program: Orca
programVersion: 5.0.4
elementType: C
charge: 0
multiplicity: 3
keywords: SP BP86 def2-QZVP def2-TZVP/C def2/J TightSCF
keywords: NoFrozenCore
formula: C
InChI: InChI=1/C
1 atoms
C  0.0000 0.0000 0.0000
totalener: -37.85149970 hartree
nucrepener: 0.00000000 hartree
electener: -37.85149970 hartree
oneelecener: -50.45287112 hartree
twoeener: 12.60137142 hartree
kineticenergy: 37.72514567 hartree
exchangeener: -5.055398558199 hartree
correlationener: -0.161745059161 hartree
xcener: -5.217143617359 hartree
s2: 2.003056
energy: -273.2864 -14.5068 -6.1816 -6.1815 -5.5990 3.3469 3.3469 3.6529 4.1637 11.5496 11.5496 11.6217 11.6217 11.9501 18.6222 18.6222 19.0973 37.3788 43.2446 43.2446 43.2822 43.2822 43.4085 43.4085 43.6279 46.7886 46.7886 46.8970 46.8970 47.3768 71.2649 71.2649 71.9881 126.4428 126.4428 126.5098 126.5098 126.5394 126.5395 126.7436 126.7438 126.9269 154.9994 154.9994 155.1227 155.1228 155.1411 155.1411 155.5105 155.5109 155.7692 155.7694 155.9377 156.6259 179.7898 715.1290 3942.1362 electronvolt
energy: -272.5183 -11.9731 -4.6625 -3.1594 -3.1594 3.9035 4.2631 4.2631 5.2276 12.6449 12.8399 12.8399 13.4175 13.4175 19.7275 20.7020 20.7020 39.5046 44.6376 44.7992 44.7992 45.2444 45.2444 45.9408 45.9408 48.4989 48.9292 48.9292 50.0976 50.0976 72.7961 74.1200 74.1200 128.2841 128.4224 128.4225 128.8045 128.8046 129.4022 129.4022 130.2038 130.2038 157.3905 157.6871 157.6872 158.0526 158.4115 158.4115 158.5828 158.5828 159.5234 159.5234 159.9125 159.9125 182.3282 716.9639 3942.6127 electronvolt
chargesum: -0.0000000
charge: -0.000000
charge: 0.000000
energy: -37.851499700348 hartree
dipole: 0.00000 -0.00000 -0.00000 0.00000 -0.00000 -0.00000 0.00000 -0.00000 -0.00000
magnitude: 0.00000 au
magnitude: 0.00000 debye
