program: Orca
programVersion: 5.0.4
elementType: C
charge: 0
multiplicity: 3
keywords: SP CCSD(T) aug-cc-pVQZ aug-cc-pVQZ/C TightSCF
keywords: NoFrozenCore
formula: C
InChI: InChI=1/C
1 atoms
C  0.0000 0.0000 0.0000
totalener: -37.69335128 hartree
nucrepener: 0.00000000 hartree
electener: -37.69335128 hartree
oneelecener: -50.44915610 hartree
twoeener: 12.75580482 hartree
kineticenergy: 37.69239501 hartree
s2: 2.010436
energy: -308.7394 -22.5674 -11.9465 -11.9465 0.4650 2.2177 2.2699 2.2699 2.9161 6.4075 6.4170 6.4170 6.4647 6.4647 11.3968 11.3968 12.6438 13.4153 20.5592 20.5924 20.5924 20.6947 20.6947 20.7074 20.7074 20.8679 20.8679 20.9887 20.9887 21.1110 42.5490 42.5490 43.4925 57.0301 57.5948 57.6374 57.6374 57.7662 57.7662 57.9826 57.9826 58.2853 58.2853 59.5614 59.5614 59.8092 59.8092 59.9349 61.6981 61.7537 61.7537 61.9211 61.9211 62.2006 62.2006 157.4154 157.4154 157.5028 161.1292 161.2009 161.2009 161.4162 161.4162 161.7763 161.7763 162.2827 162.2827 172.8989 172.9801 172.9801 173.2330 173.2330 175.7204 175.8134 175.8134 176.0939 176.0939 176.5660 176.5660 556.3274 electronvolt
energy: -307.5056 -15.8798 0.9799 1.5859 1.5859 2.4615 3.3619 4.3801 4.3801 6.5147 6.5765 6.5765 6.7779 6.7779 13.1883 14.2311 14.2311 14.4749 20.7354 20.7950 20.7950 20.9763 20.9763 21.2900 21.2900 21.8799 22.0992 22.0992 22.8343 22.8343 44.1535 45.6075 45.6075 57.8885 57.9542 57.9542 58.1516 58.1516 58.4834 58.4834 58.8411 58.9555 58.9555 61.3078 61.6935 61.6935 62.4053 62.5555 62.5555 62.9535 62.9535 63.0118 63.0118 63.8013 63.8013 158.0451 159.5089 159.5089 161.7904 161.9076 161.9076 162.2607 162.2607 162.8545 162.8545 163.6974 163.6974 174.0507 174.4823 174.4823 175.8244 175.8244 176.7400 176.9551 176.9551 177.6060 177.6060 178.7242 178.7242 557.1927 electronvolt
e0: -37.693351536 hartree
ecorr: -0.116481057 hartree
corrType: UHF
chargesum: -0.0000000
charge: -0.000000
energy: -37.812495945668 hartree
dipole: 0.00000 0.00000 0.00000 0.00000 0.00000 0.00000 0.00000 0.00000 0.00000
magnitude: 0.00000 au
magnitude: 0.00000 debye
dipolemethod: MDCI
