program: Orca
programVersion: 5.0.4
elementType: C H H
charge: 0
multiplicity: 3
keywords: SP CCSD(T) aug-cc-pVTZ aug-cc-pVTZ/C TightSCF
keywords: NoFrozenCore
formula: CH2
InChI: InChI=1/CH2/h1H2
3 atoms
C  -0.021382 -0.01544 0.055063
H  1.052971 -0.001411 0.005032
H  -0.79818 0.185395 -0.66117
totalener: -38.93815994 hartree
nucrepener: 6.17176836 hartree
electener: -45.10992831 hartree
oneelecener: -63.93687828 hartree
twoeener: 18.82694998 hartree
kineticenergy: 38.90264417 hartree
s2: 2.016204
energy: -306.5601 -25.8543 -16.8485 -12.3002 -11.1378 0.8305 1.2282 2.4165 2.5562 3.7324 3.8098 5.5176 6.1867 7.0637 7.7277 7.8527 9.1103 9.1357 9.2934 10.1163 10.7599 11.1795 11.3408 11.8045 14.8096 15.7459 19.0558 20.0993 21.7302 23.0083 23.8483 23.9909 24.9552 25.6539 26.1052 26.6734 27.0250 27.7674 28.0498 29.1515 29.2249 29.8037 29.9173 34.1452 34.2350 37.2241 37.7191 39.3896 39.4049 41.9132 42.2104 44.3380 44.5751 52.4592 52.5464 55.9242 56.8855 61.5042 77.7864 77.9786 80.4256 80.8504 87.1451 90.9944 92.4878 93.2358 93.2675 93.3219 95.5702 96.9226 97.1831 98.3499 102.3913 104.5592 109.3602 114.3911 115.1867 115.5254 115.6974 125.9913 126.6523 128.4600 134.0584 134.2454 142.7094 143.9343 144.4926 154.5988 160.8368 165.2105 172.7424 406.2405 electronvolt
energy: -305.2798 -21.1968 -16.0186 0.8883 1.2410 1.5831 1.7848 3.7801 3.9695 4.3059 4.8582 5.7871 6.4945 7.3126 8.5433 8.5756 9.1775 9.9210 10.1107 10.2973 11.3541 11.6058 11.8491 12.3036 15.9415 18.3616 19.8264 21.5518 22.1073 23.5876 24.9202 25.0637 25.2128 26.2818 26.3648 27.2771 27.3387 27.9614 28.4463 30.0917 30.9031 30.9872 31.2629 35.1892 35.2584 37.8106 38.2841 39.7065 40.1556 42.7640 43.0786 45.0949 46.0339 52.9833 53.2116 56.5372 57.2418 62.5267 78.0607 80.0439 81.5618 82.7347 88.5086 93.5505 93.9740 94.4675 94.7691 95.7296 96.7958 98.0664 98.6140 99.4296 103.5264 105.0505 109.9544 115.0470 115.6703 116.0636 116.2390 126.2075 126.7929 128.5039 134.0482 134.5785 143.3493 144.2462 145.1081 155.1167 161.1647 165.6076 173.1305 407.1166 electronvolt
e0: -38.938159800 hartree
ecorr: -0.154929491 hartree
corrType: UHF
chargesum: -0.0000000
charge: -0.899888 0.449894 0.449993
charge: 0.787774 -0.393834 -0.393940
qa: -0.8999 0.4499 0.4500
va: 3.4930 0.8161 0.8159
energy: -39.096818921709 hartree
dipole: 0.23904 -0.15655 0.08249 0.17261 -0.11303 0.05958 -0.61557 0.40309 -0.21248
magnitude: 0.23559 au
magnitude: 0.59882 debye
dipolemethod: MDCI
