program: Orca
programVersion: 5.0.4
elementType: C H H
charge: 0
multiplicity: 3
keywords: Opt RIJCOSX PBEh-3c
formula: CH2
InChI: InChI=1/CH2/h1H2
3 atoms
C  -6.567705 2.612375 0.029082
H  -5.493352 2.626404 -0.02095
H  -7.344503 2.81321 -0.687152
totalener: -39.06289744 hartree
nucrepener: 6.17793459 hartree
electener: -45.24083203 hartree
oneelecener: -63.97950815 hartree
twoeener: 18.73867612 hartree
kineticenergy: 38.80598592 hartree
exchangeener: -3.248509544318 hartree
correlationener: -0.294780371145 hartree
xcener: -3.543289915463 hartree
s2: 2.007960
dispersion: -0.000282707 hartree
s2: 2.007710
dispersion: -0.000282780 hartree
s2: 2.007118
dispersion: -0.000282974 hartree
s2: 2.007082
dispersion: -0.000282984 hartree
dispersion: -0.000282985 hartree
s2: 2.007081
energy: -285.1863 -20.8434 -13.9869 -9.1854 -8.1616 4.2184 6.6532 13.7303 13.8486 14.0107 17.9316 27.2857 29.4173 45.7231 46.2373 46.3132 57.5490 60.3581 364.7036 electronvolt
energy: -284.2812 -18.1139 -13.2989 -0.7540 -0.0187 4.9848 7.4789 14.5656 16.0943 17.0696 19.7225 28.5103 30.2156 48.1029 50.2110 50.4177 59.1912 62.1347 365.9789 electronvolt
chargesum: -0.0000000
charge: -0.441054 0.220504 0.220550
charge: -0.266008 0.133005 0.133003
qa: -0.4411 0.2205 0.2206
va: 3.7742 0.9262 0.9262
energy: -39.063024038280 hartree
dipole: 0.23904 -0.14421 0.09483 0.17261 -0.10407 0.06854 -0.61557 0.37123 -0.24434
magnitude: 0.27090 au
magnitude: 0.68858 debye
