program: Orca
programVersion: 5.0.4
elementType: C H H
charge: 0
multiplicity: 3
keywords: SP DLPNO-CCSD(T) Extrapolate(3/4,aug-cc) def2-TZVP/C def2/J TightSCF
keywords: NoFrozenCore
formula: CH2
InChI: InChI=1/CH2/h1H2
3 atoms
C  -0.021382 -0.01544 0.055063
H  1.052971 -0.001411 0.005032
H  -0.79818 0.185395 -0.66117
totalener: -38.93815994 hartree
nucrepener: 6.17176837 hartree
electener: -45.10992831 hartree
oneelecener: -63.93687829 hartree
twoeener: 18.82694998 hartree
kineticenergy: 38.90264417 hartree
s2: 2.016204
corrType: DLPNO BASED
s2: 2.016257
energy: -306.5366 -25.8487 -16.8475 -12.3047 -11.1440 0.7482 1.1071 2.0100 2.1723 3.3755 3.4134 4.8958 4.9533 5.8314 6.1384 6.1666 7.0686 7.2662 7.4314 8.1027 8.4173 8.4755 9.1258 10.1591 12.3031 12.5762 13.3418 15.4448 16.0576 17.3113 17.3954 18.5776 19.1100 19.1751 19.1810 19.9809 20.6419 20.6825 20.9749 21.0215 21.3477 21.6369 23.5377 24.5009 24.5744 25.2062 25.8825 27.7952 28.8693 28.9812 30.8810 31.1036 33.2815 38.3547 39.0058 39.9196 40.2609 41.1514 45.6274 45.7508 46.1975 46.4379 46.5916 47.9129 47.9951 49.2896 51.7822 52.3359 52.9696 53.2523 53.5713 55.2642 55.5377 55.8888 58.2012 58.3388 59.1604 59.9439 61.3366 61.8025 62.1858 62.4681 62.7235 63.9070 65.1920 66.4865 66.5894 67.5949 67.6707 69.7733 70.5427 71.0698 75.4991 75.7027 76.5699 78.2751 82.5003 90.0789 90.2204 94.5025 95.9271 96.3200 96.8158 99.6553 103.4660 105.3308 105.4693 108.8890 113.6582 114.8893 115.6247 117.1457 117.3591 125.1131 131.6889 159.0139 160.9678 161.0667 161.1096 162.2463 162.2975 163.6858 164.4528 166.7012 167.2795 173.6613 173.7605 173.9807 174.0254 175.2544 176.0215 181.1113 181.5409 185.8949 185.9733 186.6582 188.0307 192.2060 194.9093 195.7291 201.9471 207.1449 207.2878 207.9045 215.0595 218.1507 223.1858 224.3388 227.6148 229.1572 230.4947 230.5838 233.0679 244.0515 249.3904 249.7963 251.5946 252.8796 254.1171 259.2953 262.3433 264.0208 270.9667 283.3131 284.7322 286.5568 287.1688 300.2276 304.9923 330.6638 361.5611 700.3022 electronvolt
energy: -305.2486 -21.1928 -16.0219 0.7983 1.1170 1.4344 1.6187 3.4154 3.5629 3.6951 4.2719 5.0779 5.1194 6.0060 6.5352 6.5372 7.4582 7.8337 8.0987 8.1784 8.5389 9.1153 9.6222 10.5709 12.9943 13.8949 14.8635 16.5766 16.7778 18.2448 18.2835 18.6975 19.3543 19.3573 19.3865 20.7133 20.8047 21.0929 21.3242 21.7982 22.0422 22.2730 24.2879 25.1965 25.3599 25.4881 26.2581 28.4835 29.0265 29.5792 31.3968 32.1842 34.7599 38.5536 39.5570 40.1323 40.8677 41.7584 45.8805 45.9282 46.7156 46.7304 47.4867 48.0366 48.0913 50.0743 52.0726 52.5568 53.0372 53.5993 54.4115 55.3936 56.0615 56.4544 59.3930 60.1228 60.8522 60.9523 62.2214 63.2040 63.2823 63.3692 64.1094 65.1913 65.6020 67.1205 67.1545 68.2967 68.3878 70.6000 71.1586 71.6380 75.9959 76.2425 77.0438 78.8339 83.2064 90.2564 90.6483 94.8550 96.3956 96.7708 97.0839 100.0092 103.6633 105.8790 105.8820 109.2550 113.9550 115.5030 116.4136 117.7832 118.0390 125.7604 132.0055 160.0421 161.6147 161.7229 161.9798 163.3769 163.4889 164.8156 165.1950 167.6225 168.5159 174.5761 174.6440 175.2518 175.4645 177.0184 177.6954 182.2023 182.2788 186.3252 186.3328 187.2879 188.4151 192.8110 195.8576 196.4492 203.1455 207.5028 207.8513 208.9914 215.3439 218.4392 223.2706 224.4671 227.8965 229.2630 230.6765 230.6851 233.2184 244.1018 249.5386 249.8976 251.7120 252.9645 254.1767 259.4415 262.4524 264.0723 271.0504 283.6647 285.1249 286.8660 287.3471 300.3690 305.2446 330.8959 361.7051 701.0505 electronvolt
chargesum: -0.0000000
charge: -0.711714 0.355826 0.355888
charge: 1.083616 -0.541751 -0.541865
qa: -0.7117 0.3558 0.3559
va: 3.6027 0.8965 0.8964
basis: aug-cc-pVTZ aug-cc-pVQZ
scfener: -38.932409874 -38.934558828
corrmethod: MDCI MDCI
correner: -0.164252458 -0.182075774
corrcbsextra: -0.194764005
energy: -39.129900789083 hartree
dipole: 0.23904 -0.15952 0.07952 0.17261 -0.11517 0.05744 -0.61557 0.41072 -0.20485
magnitude: 0.22712 au
magnitude: 0.57730 debye
