program: Orca
programVersion: 5.0.4
elementType: C H H
charge: 0
multiplicity: 3
keywords: SP M062X aug-cc-pVDZ def2-TZVP/C def2/J TightSCF
keywords: NoFrozenCore
formula: CH2
InChI: InChI=1/CH2/h1H2
3 atoms
C  -0.021382 -0.01544 0.055063
H  1.052971 -0.001411 0.005032
H  -0.79818 0.185395 -0.66117
totalener: -39.13435903 hartree
nucrepener: 6.17176838 hartree
electener: -45.30612741 hartree
oneelecener: -63.93857478 hartree
twoeener: 18.63244737 hartree
kineticenergy: 38.89490394 hartree
xcener: -2.902861751234 hartree
s2: 2.006282
energy: -288.0413 -20.8843 -14.2493 -9.3450 -8.2308 -0.0394 0.5535 1.9188 2.0972 3.1810 3.8365 4.6783 6.1961 7.8629 9.0407 9.4722 10.4957 11.2733 12.1633 12.5944 12.6225 13.8245 15.2566 15.6229 19.5159 19.7022 22.0746 25.5690 33.8157 36.4649 38.3871 39.0137 40.5564 42.5326 48.4549 48.4677 55.9211 56.2367 57.6390 68.3066 73.7852 electronvolt
energy: -287.5659 -18.4827 -13.6712 -1.5117 -0.8561 0.4505 1.0655 2.9069 3.4079 3.7516 3.8995 5.1806 6.3718 6.9203 6.9488 6.9783 10.7128 10.7383 10.8447 11.5743 12.1599 13.5557 13.6063 14.0109 19.5794 19.6021 23.8904 26.3208 34.7757 39.4120 40.0643 40.2813 41.0894 45.6871 50.2668 50.3821 57.0467 57.4537 59.1476 74.9944 81.1045 electronvolt
chargesum: 0.0000000
charge: 0.506315 -0.251730 -0.254585
charge: 0.346635 -0.173192 -0.173444
qa: 0.5063 -0.2517 -0.2546
va: 3.7772 0.7825 0.7822
energy: -39.134359028128 hartree
dipole: 0.23904 -0.15487 0.08417 0.17261 -0.11184 0.06077 -0.61557 0.39956 -0.21601
magnitude: 0.23966 au
magnitude: 0.60918 debye
