program: Orca
programVersion: 5.0.4
elementType: C H H
charge: 0
multiplicity: 3
keywords: SP PWPB95 def2-QZVP def2-TZVP/C def2/J TightSCF
keywords: NoFrozenCore
formula: CH2
InChI: InChI=1/CH2/h1H2
3 atoms
C  -0.021382 -0.01544 0.055063
H  1.052971 -0.001411 0.005032
H  -0.79818 0.185395 -0.66117
totalener: -39.09946144 hartree
nucrepener: 6.17176838 hartree
electener: -45.27122982 hartree
oneelecener: -63.99247667 hartree
twoeener: 18.72124685 hartree
kineticenergy: 38.98789961 hartree
exchangeener: -2.933673084234 hartree
correlationener: -0.159499670595 hartree
xcener: -3.093172754829 hartree
s2: 2.007719
energy: -288.7389 -21.1930 -14.1259 -9.3947 -8.3376 1.7615 3.2067 4.3735 4.5722 4.9167 6.0549 10.5623 11.2505 12.3773 13.5640 13.6894 17.3825 18.2528 20.5266 20.9713 20.9815 22.0976 22.3479 23.2341 23.6995 29.6849 30.1520 32.8894 35.9935 46.2185 46.4929 46.5755 49.1893 49.9069 50.4382 50.8914 51.4882 53.0527 53.7252 54.6459 57.2612 62.2630 64.6348 64.9904 66.6193 67.7262 69.9009 70.3860 71.8477 73.2973 73.3277 74.5521 74.9295 88.1983 90.0623 94.0626 98.0002 98.4806 102.1446 103.0581 111.6316 130.3820 130.5396 137.0748 138.5904 140.0491 145.5095 148.5168 149.0837 153.5349 155.2296 156.1601 156.7821 158.8716 159.2797 163.1277 164.9095 165.0267 166.0508 168.1417 168.3053 173.7888 175.3953 178.4047 182.9885 183.4317 185.1836 194.7231 200.1449 203.7129 204.6899 204.8654 205.2652 205.2922 208.9681 209.3572 209.6145 220.3213 221.9078 222.4930 223.2832 224.3565 228.0654 235.2589 235.7494 236.2907 236.7104 265.1283 266.7257 272.1561 273.1775 277.9869 294.8858 311.3632 337.5633 778.9913 4030.2744 electronvolt
energy: -287.8323 -18.2775 -13.3486 -0.7054 -0.0763 2.0908 3.4104 5.1902 5.5466 6.1390 6.7818 11.2828 12.1438 13.2138 15.0368 15.2251 17.7210 18.9019 21.0718 21.4147 22.7630 22.8741 23.8341 24.0907 24.1721 29.9907 30.4496 33.4958 36.4685 47.7596 47.9946 48.0323 50.5030 51.6616 52.5055 52.5659 53.0139 54.1652 54.9533 56.0184 58.2303 62.9870 65.1905 66.1225 67.4636 68.8816 70.4272 71.2219 72.4084 73.7879 74.8274 74.9826 75.8044 88.7971 90.5101 95.2103 98.9173 99.7492 103.1610 104.3562 112.3918 132.6890 132.8840 138.6072 140.2282 141.5866 147.0307 149.9773 150.7046 155.5256 157.1667 158.2254 158.5139 161.3517 162.4940 164.7411 166.0529 166.2633 167.1687 169.6607 169.7747 174.6195 177.0447 180.4322 184.2528 185.7974 187.3304 195.8756 200.7710 204.1831 205.2452 205.3653 205.9165 205.9367 209.4198 209.8518 210.1471 221.1084 222.2325 223.1009 223.5983 225.0760 228.7642 235.6372 236.1323 236.7059 237.2813 265.8219 267.4415 273.3275 274.3212 278.7770 295.7942 312.0944 338.7889 780.8125 4030.8942 electronvolt
chargesum: -0.0000000
charge: -0.263124 0.131579 0.131545
charge: 0.408358 -0.204133 -0.204225
qa: -0.2631 0.1316 0.1315
va: 3.7939 0.9969 0.9967
total: -39.137255269 hartree
energy: -39.137255268657 hartree
dipole: 0.23904 -0.15433 0.08470 0.17261 -0.11139 0.06122 -0.61557 0.39728 -0.21829
magnitude: 0.24201 au
magnitude: 0.61515 debye
