program: Orca
programVersion: 5.0.4
elementType: C H H
charge: 0
multiplicity: 3
keywords: SP r2SCAN-3C def2-QZVP def2-TZVP/C def2/J TightSCF
keywords: NoFrozenCore
formula: CH2
InChI: InChI=1/CH2/h1H2
3 atoms
C  0.000001 0.000001 0.0000
H  0.261855 -0.365518 0.965812
H  -0.261866 0.3655 -0.965816
totalener: -39.14067913 hartree
nucrepener: 6.20897510 hartree
electener: -45.34965424 hartree
oneelecener: -64.07251988 hartree
twoeener: 18.72286564 hartree
kineticenergy: 38.97268665 hartree
exchangeener: -5.858271880087 hartree
correlationener: -0.208289191335 hartree
xcener: -6.066561071422 hartree
s2: 2.014668
energy: -274.1212 -17.7743 -12.2579 -6.0962 -6.0961 0.8843 2.8211 3.2675 4.4472 4.4475 8.0590 8.8949 10.6593 10.6593 12.1917 12.6879 12.6880 17.7819 19.0963 19.0970 20.6646 20.6659 23.4641 28.9900 29.5900 29.5905 31.1939 34.4929 40.8052 43.4507 43.4507 45.4128 45.4130 46.5722 46.5722 49.5011 49.5011 51.4908 52.3496 52.3503 61.4727 61.4728 62.9464 64.6654 71.3931 71.3933 72.5044 72.5054 74.7242 74.7244 76.7013 76.7014 81.9124 89.8108 92.5488 95.6095 95.6103 103.5893 117.2920 117.2925 128.8151 128.8155 134.0424 134.0433 135.8600 144.5879 145.4523 145.4529 151.2043 151.2047 155.2471 155.2473 158.4193 158.4194 163.3345 163.3351 163.3486 163.3491 166.1530 168.5758 168.5774 168.8526 181.3472 181.3486 191.0188 191.0197 195.6735 201.9948 202.3700 202.3702 210.6082 210.6101 216.3280 216.3291 219.2832 219.2864 223.5157 227.4948 231.5186 231.5220 240.7419 240.7424 241.7980 241.7990 242.8704 250.1358 250.1367 270.1863 286.4390 286.4399 312.0965 329.8966 329.8973 341.2942 370.3489 816.7708 4073.7827 electronvolt
energy: -273.2570 -15.1910 -11.7256 -2.0196 -2.0187 2.2948 4.6235 5.2959 6.6016 6.6033 11.2615 11.2618 11.8716 12.4699 14.7658 15.4861 15.4870 19.3277 19.7539 19.7549 23.7370 23.7395 26.2226 30.1965 30.9167 30.9185 32.3944 36.1032 43.1114 43.9415 43.9456 46.1753 46.1769 49.4203 49.4224 52.2234 52.4264 52.4376 53.0647 53.0695 60.9821 60.9864 64.6950 65.8204 71.5430 71.5446 72.1048 72.1053 75.8572 75.8618 75.9103 75.9240 81.6778 89.2511 91.1448 94.6599 94.6661 103.0247 116.2950 116.3054 129.0442 129.0487 134.6159 136.8111 136.8242 143.6166 144.4549 144.4588 151.2899 151.2970 154.9409 154.9436 156.7377 156.7407 163.2487 163.2495 165.3154 166.0491 166.0595 166.4228 166.4343 168.7653 177.0575 177.0596 190.0934 190.0952 192.8137 197.7021 198.5843 198.5898 205.9849 205.9849 211.4626 211.4636 213.5623 213.5664 220.1840 223.0225 225.7394 225.7398 235.0867 235.0898 237.1210 237.1253 239.6929 244.9279 244.9284 265.5025 281.1890 281.1965 308.5025 324.0455 324.0560 336.9593 365.2146 814.6330 4073.0273 electronvolt
chargesum: -0.0000000
charge: -0.268146 0.134073 0.134073
charge: 0.440255 -0.220128 -0.220127
qa: -0.2681 0.1341 0.1341
va: 3.8125 1.0292 1.0292
dispersion: -0.000120601 hartree
energy: -39.140408989346 hartree
dipole: -0.00001 0.00001 -0.00000 -0.00002 0.00001 -0.00001 -0.00000 0.00000 -0.00000
magnitude: 0.00001 au
magnitude: 0.00002 debye
