program: Orca
programVersion: 5.0.4
elementType: C H H
charge: 0
multiplicity: 3
keywords: SP revPBE0 def2-QZVP def2-TZVP/C def2/J TightSCF
keywords: NoFrozenCore
formula: CH2
InChI: InChI=1/CH2/h1H2
3 atoms
C  -0.021382 -0.01544 0.055063
H  1.052971 -0.001411 0.005032
H  -0.79818 0.185395 -0.66117
totalener: -39.15817897 hartree
nucrepener: 6.17176838 hartree
electener: -45.32994735 hartree
oneelecener: -63.99054205 hartree
twoeener: 18.66059469 hartree
kineticenergy: 38.98880218 hartree
exchangeener: -4.401940269226 hartree
correlationener: -0.215038477870 hartree
xcener: -4.616978747096 hartree
s2: 2.007195
energy: -279.6896 -19.2107 -12.7725 -8.1649 -7.1754 1.0960 2.5924 3.7134 3.8902 4.2834 5.0509 9.5559 10.0844 11.1413 12.3363 12.4563 16.2301 17.1123 19.4043 19.6602 19.7313 20.7880 21.1747 22.0365 22.5527 28.5609 28.8099 31.3879 34.5395 44.2465 44.5294 44.6117 47.2685 47.8462 48.4848 48.9630 49.6262 51.1637 51.8917 52.7328 55.4318 60.4991 62.8382 63.0443 64.8493 65.8876 68.1388 68.4063 70.1122 71.0268 71.6550 72.8182 73.2019 86.3370 88.0892 92.1361 95.9203 96.3448 100.1028 100.9095 109.4675 128.1901 128.3394 135.0597 136.5734 138.1062 143.5917 146.6090 147.1562 151.5793 153.3132 154.1256 154.8799 156.7884 157.1547 161.2592 163.0706 163.1450 164.1985 166.2335 166.4855 171.9544 173.5436 176.5112 181.0534 181.3894 183.2878 192.9927 198.3744 201.8667 202.8987 202.9935 203.5073 203.5894 207.2018 207.6719 207.7720 218.6959 220.1111 220.8040 221.5035 222.6743 226.5328 233.7290 234.2181 234.7414 235.1995 263.8087 265.4910 270.8499 271.9280 276.8357 293.7992 310.4547 336.7627 772.8801 4014.1131 electronvolt
energy: -278.8766 -16.8009 -12.1859 -1.8146 -1.1647 1.5320 2.8363 4.7394 4.9278 5.3972 5.9974 10.3306 10.8994 12.0210 14.2217 14.4295 16.5894 18.0538 20.1565 20.4214 21.6271 21.8302 22.8324 22.9581 23.3078 29.0528 29.2881 32.1786 34.9961 45.8617 46.4867 46.7414 48.9444 49.6786 50.8322 51.0243 51.6264 52.7430 53.4227 54.3226 56.5286 61.3713 63.5670 64.5200 65.9339 67.2841 68.8259 69.4422 70.7700 72.1801 73.0620 73.1125 74.2306 86.9857 88.4544 93.3125 96.9040 97.7815 101.1387 102.4273 110.2163 131.4100 131.6496 136.5500 138.1989 139.6867 144.9854 147.9134 148.8657 153.6616 155.1461 156.1284 156.6890 159.8476 161.2497 163.1049 164.2533 164.3595 165.1966 167.8212 167.8788 172.7424 175.2998 178.7900 182.1911 183.8145 185.3220 194.1969 198.9071 202.1936 203.3377 203.4133 204.0693 204.1001 207.5525 208.0482 208.2770 219.2157 220.2213 221.1573 221.6229 223.1583 226.9909 233.8954 234.4164 234.9679 235.5892 264.3058 265.9440 271.7687 272.8680 277.3569 294.4953 310.8654 337.8216 774.3894 4014.5459 electronvolt
chargesum: 0.0000000
charge: -0.184604 0.092327 0.092277
charge: 0.411873 -0.205891 -0.205982
qa: -0.1846 0.0923 0.0923
va: 3.7794 1.0071 1.0071
energy: -39.158178972587 hartree
dipole: 0.23904 -0.15519 0.08385 0.17261 -0.11203 0.06058 -0.61557 0.39954 -0.21603
magnitude: 0.23952 au
magnitude: 0.60880 debye
