program: Orca
programVersion: 5.0.4
elementType: C H H H
charge: 0
multiplicity: 2
keywords: SP CCSD(T) aug-cc-pVTZ aug-cc-pVTZ/C TightSCF
keywords: NoFrozenCore
formula: CH3
InChI: InChI=1/CH3/h1H3
4 atoms
C  -0.000097 0.000095 0.000062
H  1.015407 0.346221 0.091798
H  -0.507145 -0.413687 0.855101
H  -0.507102 0.066337 -0.94764
totalener: -39.57802190 hartree
nucrepener: 9.69707844 hartree
electener: -49.27510035 hartree
oneelecener: -71.61490935 hartree
twoeener: 22.33980900 hartree
kineticenergy: 39.53302668 hartree
s2: 0.761692
energy: -305.7007 -25.8132 -15.8294 -15.8240 -10.4546 0.8339 1.3072 1.3077 2.5442 3.5648 3.5660 3.8461 5.9864 5.9868 6.4219 7.3127 7.3140 8.9552 9.1678 9.1687 9.3295 10.0599 10.7916 10.8823 10.8845 11.3084 11.3102 12.5616 12.5638 16.7941 17.4386 19.8893 19.8964 22.8307 22.8309 22.8363 22.8370 23.3155 24.2938 25.9682 27.1607 27.1615 27.2011 27.4085 27.4102 29.0733 29.0794 29.5297 30.2408 30.7927 30.7948 31.1815 31.1890 35.5780 38.7367 38.7391 42.8526 43.6734 43.6902 43.6911 43.9753 44.4797 44.4872 46.9894 52.7515 52.7570 55.7223 56.0923 56.0984 59.2740 59.2803 61.0422 79.9358 80.7063 80.7072 86.8355 87.7259 87.7293 96.2199 97.7576 97.7648 97.8667 97.8676 99.5962 99.6014 100.0020 100.5885 106.1077 106.3935 108.7245 108.7270 114.9257 114.9275 118.9203 119.0508 119.0673 126.1251 130.4196 130.4218 132.0982 132.1028 136.0970 137.3432 144.0539 144.0928 146.2112 146.2258 147.8994 147.9026 152.0311 173.3687 175.9541 175.9763 182.2195 453.0767 electronvolt
energy: -305.0822 -23.3565 -15.4457 -15.4401 0.8711 1.3142 1.3147 1.6764 3.5820 3.5832 3.9953 4.4751 6.0360 6.0364 6.8875 7.5831 7.5845 9.1838 9.1847 9.3228 9.9639 10.2816 11.0671 11.0695 11.1256 11.3846 11.3863 12.6922 12.6942 18.2960 18.9376 19.9500 19.9572 23.0315 23.0327 23.2744 23.3911 23.3914 24.7570 26.3078 27.3969 27.3977 27.4437 27.6686 27.6713 29.0889 29.0951 29.5988 30.5855 30.8684 30.8708 31.9706 31.9773 36.0032 39.0028 39.0050 42.8691 43.6881 43.9356 43.9360 44.8161 44.8238 45.2074 48.1803 52.8993 52.9048 55.7113 56.5095 56.5158 59.3682 59.3748 61.6088 80.9964 80.9974 81.6882 87.2308 88.9063 88.9098 97.1592 98.2379 98.2439 98.5001 98.5011 99.8990 99.9037 100.0908 101.3102 106.4478 106.6639 108.8374 108.8399 115.1757 115.1774 119.0800 119.3334 119.3497 126.2483 130.4674 130.4696 132.0768 132.0816 136.0007 137.6290 144.0924 144.1320 146.7066 146.7210 147.9945 147.9974 152.2498 173.5407 176.0625 176.0849 182.3216 453.5359 electronvolt
e0: -39.578020831 hartree
ecorr: -0.198605456 hartree
corrType: UHF
chargesum: -0.0000000
charge: -1.316765 0.438831 0.439058 0.438876
charge: 0.852990 -0.284374 -0.284338 -0.284278
qa: -1.3168 0.4388 0.4391 0.4389
va: 3.4042 0.8739 0.8736 0.8738
energy: -39.781756786159 hartree
dipole: 0.00109 -0.00085 0.00024 -0.00106 0.00060 -0.00046 -0.00070 0.00054 -0.00015
magnitude: 0.00054 au
magnitude: 0.00138 debye
dipolemethod: MDCI
