program: Orca
programVersion: 5.0.4
elementType: C H H H
charge: 0
multiplicity: 2
keywords: SP DLPNO-CCSD(T) aug-cc-pVQZ aug-cc-pVQZ/C TightSCF
keywords: NoFrozenCore
formula: CH3
InChI: InChI=1/CH3/h1H3
4 atoms
C  -0.000097 0.000095 0.000062
H  1.015407 0.346221 0.091798
H  -0.507145 -0.413687 0.855101
H  -0.507102 0.066337 -0.94764
totalener: -39.58045063 hartree
nucrepener: 9.69707844 hartree
electener: -49.27752907 hartree
oneelecener: -71.62142727 hartree
twoeener: 22.34389819 hartree
kineticenergy: 39.54906913 hartree
s2: 0.761737
energy: -305.6730 -25.8091 -15.8315 -15.8262 -10.4624 0.7515 1.1790 1.1794 2.1512 3.2068 3.2080 3.4017 4.9959 4.9959 5.4720 5.8970 5.8975 7.1324 7.4944 7.4951 7.5516 7.6344 8.2010 8.2020 9.0197 10.2162 10.2183 10.4649 10.4654 12.9417 12.9443 13.3690 14.5002 15.9483 15.9503 18.3535 18.4360 19.1878 19.1899 19.4079 20.0077 20.3755 20.3761 20.5862 20.5879 21.0140 21.5044 21.5082 21.6973 24.2554 24.5252 24.5306 25.1161 25.1192 27.1509 27.1568 29.6610 30.2247 30.2262 30.2879 30.2946 30.7148 33.0968 35.8337 38.5685 38.5695 38.9891 40.5142 40.7929 40.7949 43.0001 43.0111 46.7349 46.7551 47.3400 47.7489 48.0182 48.2606 48.2718 49.3935 49.3979 50.2985 52.9781 53.5142 54.3894 54.3939 55.6247 55.6253 56.3253 56.3287 56.3976 57.0010 57.0014 58.6317 58.6642 60.5068 60.5188 61.5869 61.5904 62.8112 63.2123 63.2145 66.6437 66.6475 68.7529 70.0005 71.3519 71.3533 72.3920 72.9424 76.3820 76.3844 76.3892 76.3910 78.8712 80.5821 80.6085 82.8180 88.3953 88.4036 90.0151 94.8328 94.8404 97.6181 97.6299 98.6133 102.2589 102.6560 102.6640 105.6753 105.6830 107.8125 111.3393 113.7804 114.3009 114.3084 116.7851 116.7878 120.9337 121.4371 121.4381 128.9167 130.6299 130.6413 134.1127 159.3825 162.4960 162.8595 163.8069 163.8216 165.5850 165.5941 170.6375 171.7937 171.7992 174.3038 174.3126 176.1196 182.5916 183.8786 183.8824 184.4654 185.8562 187.5246 187.5326 188.3705 188.3878 193.7726 197.0366 197.0714 197.9325 201.1945 201.2096 206.5543 206.5750 210.4920 210.5343 217.7182 217.7431 220.8055 227.3755 227.3808 230.9340 230.9752 231.3594 234.0825 234.4213 234.4410 238.1608 241.8415 246.9927 246.9993 250.1547 252.0136 252.0228 252.3027 252.3080 262.7412 264.1962 264.2054 266.1719 268.9350 269.1263 277.5449 277.5637 281.5897 281.5997 286.3104 286.4824 291.0970 291.1238 297.2726 321.1360 321.2390 337.8849 357.9245 357.9517 732.1621 electronvolt
energy: -305.0499 -23.3538 -15.4505 -15.4448 0.7839 1.1844 1.1848 1.5295 3.2215 3.2227 3.5240 3.9130 5.0303 5.0305 5.7958 6.0791 6.0796 7.4986 7.4994 7.5486 7.6730 8.0828 8.2373 8.2383 9.3434 10.2376 10.2400 10.5974 10.5983 12.9986 13.0012 15.2535 15.4532 16.4562 16.4582 18.3250 18.6945 19.2773 19.2794 19.6275 20.1574 20.4927 20.4935 20.7326 20.7345 21.3134 21.6259 21.6296 21.7316 24.4539 24.5510 24.5562 25.8364 25.8393 27.2772 27.2831 29.6829 30.4115 30.4130 30.4879 30.4947 30.7385 34.4159 36.7117 38.7113 38.7122 38.9346 40.9243 40.9264 41.1180 42.9774 42.9885 46.8732 46.8934 47.5704 47.7408 48.2962 48.3074 48.5732 49.4064 49.4108 50.3303 53.0226 53.5241 54.5532 54.5578 55.7216 55.7223 56.4615 56.5139 56.5169 58.0367 58.0373 58.8424 59.6200 60.6014 60.6132 62.0108 62.0136 63.1911 63.5343 63.5360 66.9708 66.9746 69.3181 70.1925 71.6024 71.6036 73.3543 73.5120 76.5907 76.5923 76.6951 76.6975 78.8726 80.6943 80.7209 83.1480 88.4264 88.4342 90.2801 94.9311 94.9388 97.8922 97.9038 98.6185 102.5073 102.9588 102.9669 105.7703 105.7780 108.0275 111.3861 113.8678 114.4210 114.4284 117.4359 117.4388 121.2006 121.5125 121.5137 129.5096 130.7034 130.7145 134.2054 160.1090 163.1637 163.1842 164.1855 164.2002 166.1457 166.1547 171.8588 172.3696 172.3751 174.9469 174.9562 176.2243 183.0201 183.9496 183.9533 184.4786 186.5609 187.6148 187.6172 188.7084 188.7196 193.9526 197.1886 197.2237 198.1414 201.2896 201.3045 207.1734 207.1957 210.8360 210.8766 217.8389 217.8636 220.9080 227.4270 227.4323 230.9384 230.9793 231.4096 234.1559 234.5069 234.5262 238.1333 241.9544 246.9833 246.9898 250.2479 252.0619 252.0712 252.3513 252.3566 262.7500 264.1711 264.1803 266.2340 268.8762 269.1950 277.4875 277.5065 281.8059 281.8160 286.3269 286.7933 291.1523 291.1793 297.3554 321.1642 321.2673 337.9527 357.9618 357.9891 732.5355 electronvolt
chargesum: 0.0000000
charge: -1.015479 0.338274 0.338746 0.338460
charge: 1.228392 -0.409520 -0.409464 -0.409408
qa: -1.0155 0.3383 0.3387 0.3385
va: 3.5593 0.9391 0.9389 0.9390
corrType: DLPNO BASED
energy: -39.802996465163 hartree
dipole: 0.00109 -0.00085 0.00023 -0.00106 0.00057 -0.00049 -0.00070 0.00055 -0.00015
magnitude: 0.00056 au
magnitude: 0.00142 debye
