program: Gaussian 09
title: 000070374
version: EM64L-G09RevD.01
frameworkgroup: C1[X(C10H14N4O2)]
method: RPBEPBE
basis: SDD
operation: Freq
keyword: #p
keyword: freq=noraman
keyword: PBEPBE/SDD
title: #p freq=noraman PBEPBE/SDD
converged: YES YES NO NO
title: Mulliken charges:
elementType: O O N N N N C C C C C C C C C C H H H H H H H H H H H H H H
charge: -0.246614 -0.261641 -0.099587 -0.361230 -0.045961 0.005345 -0.337479 -0.348854 -0.316067 -0.313226 -0.320120 0.182843 0.061651 -0.319713 -0.296024 -0.237463 0.222350 0.203518 0.200655 0.210559 0.218827 0.191662 0.192954 0.215625 0.239544 0.223434 0.344648 0.290663 0.249034 0.250669
chargesum: 0.00000
title: Mulliken charges with hydrogens summed into heavy atoms:
elementType: O O N N N N C C C C C C C C C C
charge: -0.246614 -0.261641 -0.099587 -0.016582 -0.045961 0.005345 0.088389 0.062359 0.094422 0.095352 0.142858 0.182843 0.061651 -0.029049 -0.046990 0.013206
polarizability: 1.85776458e+02 1.39145662e+01 1.27514200e+02 -1.58426422e+01 1.38766043e+01 1.05483047e+02
1716.lowfreq: -10.5991 -8.2219 -0.0006 -0.0003 0.0004 4.1253 22.6842 30.3735 35.9945
frequency: 22.3398 30.1330 35.0554 72.7229 115.5429 133.2701 185.6852 216.2329 245.8245 251.1016 293.5432 319.9386 367.7449 388.3154 412.4529 440.9410 455.8403 467.0435 530.6659 591.5954 604.9440 699.4376 709.0336 749.2621 770.5294 774.9720 803.8828 833.8030 843.2962 860.3223 898.0563 960.4588 960.8529 980.7645 994.0392 1004.6668 1025.4117 1035.5235 1052.3110 1068.1219 1084.7689 1107.4497 1129.6518 1148.5743 1163.3523 1167.9236 1192.3202 1230.4438 1237.0213 1262.2737 1271.3081 1282.8730 1288.9329 1296.8580 1332.2911 1346.2064 1362.5947 1371.2289 1382.5660 1394.5868 1432.8837 1442.3806 1447.9412 1451.6704 1459.6952 1480.2556 1497.8074 1499.9171 1534.5446 1611.8215 2878.5069 2890.1575 2932.6511 2954.7215 2958.4674 3006.7152 3023.9592 3043.1392 3082.9250 3086.5008 3141.6255 3165.5084 3176.1220 3478.2766
redmass: 5.5309 4.7555 3.7054 7.9539 4.8440 4.4809 3.4160 3.2820 4.4760 2.4186 4.7133 2.3140 3.1648 1.9346 4.5892 8.4255 6.5720 2.9112 4.5082 2.0468 7.4788 6.3626 5.6170 1.6087 2.2175 2.3206 3.9735 3.2002 1.7589 1.5285 2.6238 1.3801 1.5570 4.9901 2.9345 3.3493 2.1924 2.6087 1.9462 2.5348 3.6199 2.3744 2.5810 2.1021 2.8579 2.4672 1.0757 1.2802 3.8120 2.2933 1.3023 1.4547 1.3397 1.4171 1.2529 1.2513 1.4069 1.2604 1.8371 1.3680 1.9340 1.0831 1.0790 1.0978 1.1033 1.1496 2.1421 6.3110 4.9800 9.3668 1.0695 1.0691 1.0628 1.0666 1.0666 1.0981 1.0904 1.0905 1.0962 1.0977 1.0885 1.0976 1.0951 1.0771
irintensity: 2.8537 0.6138 0.5626 2.9811 3.0237 0.5441 10.4627 10.6796 2.0543 1.1152 9.1848 9.7599 3.3301 0.2794 6.4694 8.6070 13.0419 1.1979 12.4677 6.5445 1.5854 3.3796 3.8230 88.6630 70.1295 1.5028 10.7663 5.4846 0.4482 18.3469 23.6425 1.6256 0.4724 26.3877 34.3396 11.4823 12.0565 4.6600 16.4629 11.7766 66.1135 6.0283 106.4102 23.3354 21.5087 3.9142 1.8843 5.9143 18.1812 2.9923 17.9521 2.2980 56.1525 19.3726 0.7112 11.9253 20.0320 1.2813 29.4995 11.2148 41.5296 1.9159 1.0087 17.2064 5.5544 47.4300 269.1896 24.2455 6.1565 179.7863 65.3458 78.7528 45.9799 27.5147 105.1785 23.1275 52.8238 30.5142 40.5071 33.0610 0.7418 34.9793 0.9736 52.6758
temp: 298.150 k
press: 1.00000 atm
elementType: 8 8 7 7 7 7 6 6 6 6 6 6 6 6 6 6 1 1 1 1 1 1 1 1 1 1 1 1 1 1
symmnumber: 1
zpe: 633644.6 jmol-1
zpe.correction: 0.241342 hartree
zpe.thermalcorrener: 0.255652 hartree
zpe.thermalcorrenthalpy: 0.256596 hartree
zpe.thermalcorrgfe: 0.197564 hartree
zpe.sumelectzpe: -757.678811 hartree
zpe.sumelectthermal: -757.664502 hartree
zpe.sumelectthermalent: -757.663558 hartree
zpe.sumelectthermalfe: -757.722589 hartree
dipole: -0.3356 -2.6421 -2.8430
dipole: 3.8957
quadrupole: -101.9854 -95.8662 -92.4632
quadrupole: 14.8338 -1.5032 -2.2253
quadrupole: -5.2138 0.9054 4.3084 14.8338 -1.5032 -2.2253
hfenergy: -757.9201537 hartree
pointgroup: C01 [X(C10H14N4O2)]
dipole: 0.1070398 0.7672839 -1.3224583 debye
polarizability: 185.3633759|18.0859846|121.0432472|12.0317622|-17.213712|112.3670816 unknown
InChI: InChI=1S/C10H14N4O2/c15-10(9-7-11-1-2-12-9)13-8-14-3-5-16-6-4-14/h1-2,7,13H,3-6,8H2
charge 0 multiplicity 1
30 atoms
O  -4.78319 0.973993 0.632066
O  1.038942 -1.93537 1.15645
N  -2.36997 -0.300424 -0.33498
N  0.004851 -0.673872 -0.53733
N  2.239473 0.808005 -0.907507
N  4.609007 0.325457 0.610634
C  -2.425502 0.300596 1.023998
C  -3.709282 -0.786368 -0.753919
C  -3.448377 1.447159 1.038645
C  -4.711059 0.380513 -0.712877
C  -1.308386 -1.315687 -0.479869
C  1.058231 -1.014226 0.279346
C  2.296194 -0.175477 0.045596
C  3.474122 -0.41266 0.797878
C  3.368926 1.545624 -1.095744
C  4.544395 1.304745 -0.342106
H  -1.42467 0.689572 1.286619
H  -2.71243 -0.460683 1.790367
H  -4.080866 -1.60665 -0.091154
H  -3.646066 -1.180717 -1.786461
H  -3.57704 1.85269 2.055494
H  -3.112821 2.254528 0.35241
H  -4.405327 1.15521 -1.448972
H  -5.733497 0.035056 -0.938041
H  -1.265957 -2.050686 0.355474
H  -1.502945 -1.86914 -1.419617
H  0.155324 0.104647 -1.190325
H  3.493802 -1.203338 1.55214
H  3.328886 2.333039 -1.854893
H  5.450132 1.899462 -0.497624
