program: Gaussian 09
title: 000070370
version: EM64L-G09RevD.01
frameworkgroup: C1[X(C14H22OS)]
method: RPBEPBE
basis: SDD
operation: Freq
keyword: #p
keyword: freq=noraman
keyword: PBEPBE/SDD
title: #p freq=noraman PBEPBE/SDD
converged: NO YES NO NO
title: Mulliken charges:
elementType: S O C C C C C C C C C C C C C C H H H H H H H H H H H H H H H H H H H H H H
charge: -0.024436 -0.430649 0.159854 0.083512 0.350784 0.398237 -0.090281 -0.750875 -0.729629 -0.728314 -0.695544 -0.695328 -0.749719 -0.333250 -0.354738 -0.397817 0.215203 0.218523 0.219398 0.209496 0.202326 0.262429 0.261440 0.201884 0.211578 0.204036 0.234967 0.217044 0.203183 0.217282 0.237281 0.223356 0.225771 0.219443 0.282769 0.279612 0.337250 0.103924
chargesum: 0.00000
title: Mulliken charges with hydrogens summed into heavy atoms:
elementType: S O C C C C C C C C C C C C C C
charge: 0.079488 -0.093399 0.159854 0.083512 0.350784 0.398237 -0.090281 -0.097751 -0.055379 -0.053412 -0.039498 -0.037582 -0.081150 -0.050481 -0.075126 -0.397817
polarizability: 1.96691234e+02 -1.34874444e+00 1.99020377e+02 -1.64125331e+00 2.80351691e+00 1.23552765e+02
1716.lowfreq: -12.9701 -10.2362 -6.5317 -0.0011 0.0019 0.0023 44.4353 68.0776 74.7543
frequency: 44.3543 68.0277 74.7389 94.9977 128.2430 142.0793 150.0886 154.9798 161.5583 180.6875 214.8957 247.1922 263.7014 264.8391 265.6451 299.1748 308.8448 330.1589 333.1376 335.6778 341.1790 357.4658 374.5952 384.1303 393.0556 399.9061 430.7545 444.6722 513.8229 526.4597 566.1167 597.6918 620.9171 686.9930 743.1871 778.9081 793.7140 839.8848 863.5756 881.8643 904.4089 913.3574 915.8098 925.2904 927.7306 928.7139 946.6867 948.5057 1019.4402 1023.8290 1025.3226 1032.0561 1104.0100 1131.8160 1140.4851 1193.2115 1198.1939 1203.9011 1207.4059 1222.0638 1248.6736 1270.1943 1283.8171 1364.6788 1367.9744 1373.7970 1382.5315 1386.2971 1396.5155 1407.5494 1411.5240 1422.3843 1455.4559 1456.2474 1465.9270 1471.5959 1474.5758 1477.5036 1478.9232 1485.9474 1490.2966 1492.4439 1502.1247 1507.8449 1577.3440 1591.6947 2397.6806 2970.9269 2973.0720 2974.2966 2975.4851 2979.8876 2982.4965 3054.7727 3059.7022 3061.1019 3064.7289 3071.3675 3075.1126 3075.7524 3077.6075 3083.8274 3085.2139 3111.3209 3114.2824 3180.1200 3183.0117 3597.0466
redmass: 3.2789 2.5159 3.6408 1.1242 1.1497 2.1909 2.8929 4.0958 4.4028 1.4055 1.0706 1.4529 2.5880 2.3442 1.7757 2.2322 2.5255 1.3089 3.7961 1.3626 1.1300 8.0338 2.2385 2.9943 2.9197 2.1463 2.7787 3.5819 2.9779 2.6259 3.3511 4.0509 4.5529 7.6725 4.8834 5.3673 3.7522 1.4215 2.4603 2.4477 1.4347 1.6012 1.5241 1.6586 1.6968 1.6898 1.2013 1.2026 1.4184 1.3769 1.3887 1.3802 2.8487 2.4954 1.5890 2.3277 2.9075 2.9445 3.6729 2.3504 2.2099 2.2037 2.0955 5.3262 1.1823 1.2276 1.2105 1.1629 1.3959 2.1923 1.3975 2.3343 1.0511 1.0484 1.0592 1.0525 1.0633 1.0483 1.0542 1.1188 1.0517 1.0507 1.0623 1.0601 5.9426 7.1825 1.0388 1.0364 1.0353 1.0362 1.0367 1.0374 1.0358 1.0980 1.0979 1.0999 1.0991 1.0999 1.0984 1.0994 1.1005 1.0993 1.0998 1.0979 1.0972 1.0905 1.0911 1.0651
irintensity: 0.0563 0.3581 0.5155 22.5665 3.0997 0.1712 5.3226 2.1268 3.6666 0.6075 0.2842 0.1918 29.5812 17.9454 0.6829 6.1161 0.0603 24.9737 3.4827 14.6895 11.3063 1.0361 6.9716 0.3031 1.0506 8.9471 0.5973 4.1858 0.2334 0.3462 4.3590 7.4926 0.1653 17.7938 0.3127 5.9026 4.7207 18.2810 14.5684 18.1665 1.5731 1.5705 8.5369 3.8693 1.4706 8.4012 1.1624 0.2893 0.5341 2.8808 0.3595 0.5843 68.4048 39.3623 37.7287 8.8126 9.3438 7.3665 25.3853 24.4275 78.0686 2.4016 23.8803 12.2299 24.0736 27.0175 16.3338 18.4973 31.6764 4.8089 56.2194 70.6873 0.2013 0.1174 2.4523 2.4918 0.5911 0.1802 2.8647 6.4298 8.2697 11.5829 22.1770 17.5151 3.9374 1.5392 36.8202 22.7538 18.2830 42.1645 44.7952 59.9654 14.9180 7.4095 71.8745 10.2923 19.8390 44.5020 94.6934 11.7239 3.9769 74.6123 42.2680 0.4480 22.3809 1.7985 1.0121 60.2649
temp: 298.150 k
press: 1.00000 atm
elementType: 16 8 6 6 6 6 6 6 6 6 6 6 6 6 6 6 1 1 1 1 1 1 1 1 1 1 1 1 1 1 1 1 1 1 1 1 1 1
symmnumber: 1
zpe: 842810.0 jmol-1
zpe.correction: 0.321009 hartree
zpe.thermalcorrener: 0.340135 hartree
zpe.thermalcorrenthalpy: 0.341079 hartree
zpe.thermalcorrgfe: 0.275664 hartree
zpe.sumelectzpe: -1018.713676 hartree
zpe.sumelectthermal: -1018.694551 hartree
zpe.sumelectthermalent: -1018.693607 hartree
zpe.sumelectthermalfe: -1018.759021 hartree
dipole: 1.9838 -2.0035 1.0606
dipole: 3.0124
quadrupole: -97.4529 -111.1685 -107.7224
quadrupole: -5.4852 -0.6001 5.2634
quadrupole: 7.9951 -5.7206 -2.2745 -5.4852 -0.6001 5.2634
hfenergy: -1019.0346857 hartree
pointgroup: C01 [X(C14H22O1S1)]
dipole: 0.7765246 0.8233953 -0.351622 debye
polarizability: 196.7559865|1.4942387|197.4804834|-0.2871576|10.9205206|125.0279062 unknown
InChI: InChI=1S/C14H22OS/c1-13(2,3)10-7-9(16)8-11(12(10)15)14(4,5)6/h7-8,15-16H,1-6H3
charge 0 multiplicity 1
38 atoms
S  -0.091858 -4.050887 -0.359171
O  -0.07748 1.987799 0.226612
C  -2.643494 0.694565 0.161614
C  2.583861 0.622842 -0.000747
C  -1.303369 -0.077906 0.039589
C  1.212505 -0.11282 -0.038552
C  -0.034548 0.582284 0.072912
C  -3.867516 -0.259108 0.094781
C  -2.779523 1.71385 -1.011473
C  -2.708772 1.442011 1.529166
C  2.705368 1.631357 -1.19167
C  2.788502 1.343606 1.373115
C  3.7728 -0.366171 -0.14913
C  -1.286595 -1.485941 -0.104561
C  1.154126 -1.520738 -0.191686
C  -0.077751 -2.198553 -0.229392
H  -3.914539 -0.809375 -0.863439
H  -3.86892 -0.991579 0.923184
H  -4.791878 0.340822 0.180098
H  -2.769691 1.190134 -1.985693
H  -3.740117 2.25628 -0.923492
H  -1.960124 2.448664 -0.998552
H  -1.889413 2.170603 1.626023
H  -3.671264 1.981837 1.612272
H  -2.644768 0.72461 2.36847
H  1.920618 2.410286 -1.217515
H  2.641591 1.089024 -2.152049
H  3.682457 2.147434 -1.149714
H  2.020069 2.101037 1.617909
H  3.769399 1.853848 1.387972
H  2.770624 0.603089 2.192635
H  3.736935 -0.91114 -1.109574
H  3.798875 -1.104153 0.672496
H  4.721718 0.200004 -0.120798
H  -2.22569 -2.04251 -0.114356
H  2.072289 -2.103273 -0.285495
H  0.835875 2.359479 0.257682
H  -0.427103 -4.122413 -1.70557
