program: Orca
programVersion: 5.0.4
elementType: C H H H H
charge: 0
multiplicity: 1
keywords: Freq RIJCOSX PBEh-3c
frequency: 0.00 0.00 0.00 0.00 0.00 0.00 1389.86 1390.16 1390.27 1618.99 1619.40 3121.79 3254.70 3255.19 3256.14
frequency: 1389.86 1390.16 1390.27 1618.99 1619.40 3121.79 3254.70 3255.19 3256.14
formula: CH4
InChI: InChI=1/CH4/h1H4
5 atoms
C  -4.52012 2.7921 -0.007446
H  -3.48222 3.058303 -0.188022
H  -5.035283 3.632414 0.449969
H  -4.563651 1.934332 0.65807
H  -4.999536 2.543391 -0.950421
totalener: -40.42712213 hartree
nucrepener: 13.47724536 hartree
electener: -53.90436749 hartree
oneelecener: -79.89112174 hartree
twoeener: 25.98675425 hartree
kineticenergy: 40.08068762 hartree
exchangeener: -3.654361828199 hartree
correlationener: -0.399144285149 hartree
xcener: -4.053506113348 hartree
energy: -283.3704 -21.0966 -12.1208 -12.1195 -12.1184 4.7619 5.9668 5.9678 5.9685 13.8100 13.8110 13.8128 28.2569 28.2587 28.2609 29.0274 29.9267 46.6094 46.6115 63.0882 63.0885 63.0903 372.7719 electronvolt
chargesum: 0.0000000
charge: -0.880925 0.220199 0.220237 0.220267 0.220222
charge: -0.522541 0.130619 0.130640 0.130643 0.130639
qa: -0.8809 0.2202 0.2202 0.2203 0.2202
va: 3.7476 0.9164 0.9164 0.9164 0.9164
dispersion: -0.000682780 hartree
energy: -40.426628211318 hartree
dipole: -0.00015 0.00006 -0.00009 0.00003 -0.00007 -0.00004 -0.00043 0.00034 -0.00009
magnitude: 0.00013 au
magnitude: 0.00034 debye
temp: 298.15 k
press: 1.00 atm
zeropoint: 0.04623886 hartree
thermalvibcorrection: 0.00002921 hartree
thermalrotcorrection: 0.00141627 hartree
thermaltrasncorrection: 0.00141627 hartree
thermaltotal: -40.37752760 hartree
thermalcorr: 0.00286175 hartree
nonthermalcorr: 0.04623886 hartree
totalcorr: 0.04910061 hartree
thermalcorrenthalpy: 0.00094421 hartree
totalenthalpy: -40.37658340 hartree
vibrat: 0.00003344 hartree
rotat: 0.00714582 hartree
transl: 0.01627961 hartree
total: 0.02345887 hartree
totalentropycorr: -0.02345887 hartree
gibbsenthalpy: -40.40004226 hartree
gibbsminuselec: 0.02658595 hartree
