program: Orca
programVersion: 5.0.4
elementType: C H H H H
charge: 0
multiplicity: 1
keywords: SP DLPNO-CCSD(T) aug-cc-pV5Z aug-cc-pV5Z/C TightSCF
keywords: NoFrozenCore
formula: CH4
InChI: InChI=1/CH4/h1H4
5 atoms
C  0.000013 -0.000003 0.000039
H  1.037913 0.266201 -0.180537
H  -0.51515 0.840312 0.457454
H  -0.043518 -0.85777 0.665555
H  -0.479403 -0.248711 -0.942936
totalener: -40.21698429 hartree
nucrepener: 13.47724534 hartree
electener: -53.69422964 hartree
oneelecener: -79.81869178 hartree
twoeener: 26.12446214 hartree
kineticenergy: 40.18604089 hartree
chargesum: 0.0000000
charge: -0.590130 0.147557 0.147575 0.147637 0.147361
charge: 1.524961 -0.381249 -0.381224 -0.381305 -0.381183
qa: -0.5901 0.1476 0.1476 0.1476 0.1474
va: 3.9078 0.9795 0.9795 0.9794 0.9797
e0: -40.216984291 hartree
corrType: DLPNO BASED
energy: -40.492333790521 hartree
dipole: -0.00015 0.00015 -0.00000 0.00003 -0.00004 -0.00001 -0.00043 0.00041 -0.00002
magnitude: 0.00003 au
magnitude: 0.00007 debye
