program: Orca
programVersion: 5.0.4
elementType: C H H H H
charge: 0
multiplicity: 1
keywords: SP DLPNO-CCSD(T) Extrapolate(3/4,aug-cc) def2-TZVP/C def2/J TightSCF
keywords: NoFrozenCore
formula: CH4
InChI: InChI=1/CH4/h1H4
5 atoms
C  0.000013 -0.000003 0.000039
H  1.037913 0.266201 -0.180537
H  -0.51515 0.840312 0.457454
H  -0.043518 -0.85777 0.665555
H  -0.479403 -0.248711 -0.942936
totalener: -40.21364776 hartree
nucrepener: 13.47724534 hartree
electener: -53.69089311 hartree
oneelecener: -79.81082093 hartree
twoeener: 26.11992783 hartree
kineticenergy: 40.16783196 hartree
e0: -40.213647763 hartree
corrType: DLPNO BASED
energy: -304.8949 -25.6787 -14.8470 -14.8456 -14.8439 0.7466 1.2287 1.2288 1.2288 2.8929 2.8931 2.8933 3.3575 5.0343 5.0343 5.0344 5.6343 5.6345 7.2989 7.3872 7.3875 7.3878 7.6295 7.6296 7.6296 7.9524 7.9526 7.9528 9.0538 10.6763 10.6766 10.6769 10.6819 10.6826 14.8947 14.8952 14.8953 15.0779 15.0782 16.5388 18.5821 18.5826 18.5827 19.4430 19.4431 19.4434 19.8884 19.8888 19.8894 20.3541 20.9602 20.9611 20.9618 21.7431 21.7441 21.7443 24.0265 24.0266 24.0275 24.0769 24.8045 24.8047 26.8292 26.8302 29.0593 29.0600 29.0616 30.2342 31.2138 31.2150 31.2159 33.5073 33.5081 33.5084 37.2417 37.2418 37.2421 40.7438 40.7457 40.7471 41.3491 42.4058 42.4068 42.4073 44.8988 44.8991 49.6626 49.6641 49.6662 50.2668 50.2686 50.2696 51.3408 51.7302 51.7311 51.9886 51.9915 51.9956 53.1828 54.4302 54.4317 54.4322 54.6925 54.6939 56.4045 56.4071 56.4087 57.1027 57.1042 57.1055 58.6665 59.1562 60.9935 60.9968 60.9979 62.3732 62.3741 62.3743 65.5605 65.5613 65.5634 72.1622 72.1630 72.1668 73.2539 73.2544 76.0395 76.0403 76.0405 76.1804 76.1818 76.1826 76.2505 81.0975 81.0987 81.9161 81.9169 81.9175 85.7097 85.7125 85.7148 86.9281 91.5813 91.5821 100.2926 100.2941 100.2980 100.3186 100.3202 100.3204 105.1464 105.6877 105.6893 105.6914 108.9804 108.9825 108.9830 112.0419 112.0435 112.0464 113.5505 115.9497 115.9508 117.0238 117.0256 117.0263 117.2130 117.2153 128.5407 128.5456 128.5471 134.0602 134.0622 134.0708 140.1968 166.0027 166.0060 167.1806 167.1851 167.1877 169.5069 169.5079 169.5088 176.6183 183.0342 185.1264 185.1281 185.1297 186.9658 186.9670 186.9674 187.7644 187.7796 187.7818 190.2063 190.2157 190.2228 196.0359 196.0376 196.0392 200.5453 204.6415 206.4136 206.4152 206.4182 211.4320 211.4330 213.8243 213.8322 213.8456 214.3392 214.3443 214.3463 219.8640 219.8658 230.9681 230.9685 230.9688 231.8617 232.9091 232.9203 235.1487 235.1523 235.1558 247.7123 247.7152 247.7207 250.1699 250.1705 250.1716 252.5488 252.5515 252.5542 256.6166 256.6201 256.6249 261.0507 261.0556 264.4418 271.0677 271.0738 273.4771 273.4781 273.4808 279.0354 279.0358 279.0364 280.1928 280.1929 288.2768 288.2833 288.2879 297.4823 298.4139 298.4172 298.4226 313.1484 313.1546 313.1675 358.8724 358.8835 358.8955 376.0564 807.5197 electronvolt
chargesum: -0.0000000
charge: -0.969458 0.242380 0.242377 0.242444 0.242257
charge: 1.307511 -0.326886 -0.326859 -0.326945 -0.326821
qa: -0.9695 0.2424 0.2424 0.2424 0.2423
va: 3.7604 0.9583 0.9583 0.9583 0.9582
e0: -40.216277277 hartree
basis: aug-cc-pVTZ aug-cc-pVQZ
scfener: -40.213647763 -40.216277277
corrmethod: MDCI MDCI
correner: -0.246697379 -0.266346572
corrcbsextra: -0.280334626
energy: -40.497319105680 hartree
dipole: -0.00015 0.00015 -0.00000 0.00003 -0.00004 -0.00001 -0.00043 0.00041 -0.00002
magnitude: 0.00003 au
magnitude: 0.00007 debye
