program: Orca
programVersion: 5.0.4
elementType: C H H H H
charge: 0
multiplicity: 1
keywords: SP F12/RI-CCSD(T) cc-pVTZ-F12 cc-pVTZ-F12-CABS cc-pVQZ/C VeryTightSCF
keywords: NoFrozenCore
formula: CH4
InChI: InChI=1/CH4/h1H4
5 atoms
C  0.000013 -0.000003 0.000039
H  1.037913 0.266201 -0.180537
H  -0.51515 0.840312 0.457454
H  -0.043518 -0.85777 0.665555
H  -0.479403 -0.248711 -0.942936
totalener: -40.21584008 hartree
nucrepener: 13.47724537 hartree
electener: -53.69308545 hartree
oneelecener: -79.81563872 hartree
twoeener: 26.12255327 hartree
kineticenergy: 40.18516248 hartree
energy: -304.8956 -25.6800 -14.8483 -14.8469 -14.8452 1.6603 2.1067 2.1068 2.1069 5.7251 5.7254 5.7255 6.3922 9.5996 9.5998 9.6000 10.1839 10.1845 13.2654 13.2663 13.2671 14.3904 16.5258 16.8951 16.8960 16.8961 21.3361 21.3364 21.3374 23.0831 23.0870 23.0880 26.5789 26.5800 27.7845 27.7852 27.7862 29.0755 37.4949 37.4957 37.4968 39.9503 41.2892 41.2913 41.2918 46.3294 46.3303 49.0591 49.0623 49.0637 49.6404 49.6423 49.6428 52.3317 52.3320 52.3328 55.5290 55.7592 55.7619 55.8195 57.7153 57.7163 57.7176 62.5976 62.5987 62.5993 64.2782 64.2789 66.6136 66.6161 66.6194 70.8903 70.8931 70.8948 73.2490 73.2496 73.2512 81.6725 81.6734 81.6758 87.8552 87.8575 87.8589 88.4828 93.0586 98.0482 98.0505 103.1928 103.1935 103.1949 132.2201 132.2207 132.2216 135.3926 135.3940 135.3971 149.1639 162.9519 162.9527 163.1494 163.1511 163.1563 165.3432 165.3470 165.3550 167.4998 167.5000 167.5005 180.4932 195.2298 195.2336 195.2395 228.8752 228.8788 233.8212 233.8247 233.8279 253.1330 258.5893 258.5944 258.6009 588.7012 588.7090 588.7155 617.0329 electronvolt
chargesum: 0.0000000
charge: -0.380788 0.095205 0.095197 0.095243 0.095143
charge: 0.553515 -0.138387 -0.138366 -0.138440 -0.138321
qa: -0.3808 0.0952 0.0952 0.0952 0.0951
va: 3.9808 1.0183 1.0183 1.0183 1.0183
energy: -40.506363528052 hartree
dipole: -0.00015 0.00014 -0.00001 0.00003 -0.00004 -0.00001 -0.00043 0.00039 -0.00004
magnitude: 0.00004 au
magnitude: 0.00011 debye
dipolemethod: MDCI
