program: Orca
programVersion: 5.0.4
elementType: C H H H H
charge: 0
multiplicity: 1
keywords: SP M062X 6-311+G(d,p) def2-TZVP/C def2/J TightSCF
formula: CH4
InChI: InChI=1/CH4/h1H4
5 atoms
C  0.000009 0.000005 0.00003
H  1.037925 0.266164 -0.180508
H  -0.515142 0.840283 0.457516
H  -0.043508 -0.857748 0.665573
H  -0.479385 -0.248758 -0.942935
totalener: -40.49690081 hartree
nucrepener: 13.47726585 hartree
electener: -53.97416666 hartree
oneelecener: -79.89670404 hartree
twoeener: 25.92253739 hartree
kineticenergy: 40.29800787 hartree
xcener: -3.321760707809 hartree
energy: -286.0945 -21.4022 -12.4146 -12.4136 -12.4121 0.6387 1.6941 1.6942 1.6945 5.1351 5.1361 5.1365 6.4788 11.8057 11.8063 11.8066 17.8594 17.8618 17.8632 17.8959 23.9727 27.9053 27.9071 41.1173 41.1177 41.1196 43.0245 43.0267 43.0316 52.7673 52.7695 52.7717 63.2820 63.8530 63.8542 68.2539 68.2571 68.2578 70.8609 70.8731 70.8742 78.8892 104.6156 104.6275 104.6378 656.2031 electronvolt
chargesum: 0.0000000
charge: -0.594977 0.148818 0.148728 0.148659 0.148772
charge: -0.182543 0.045650 0.045631 0.045610 0.045653
qa: -0.5950 0.1488 0.1487 0.1487 0.1488
va: 3.8773 0.9502 0.9502 0.9503 0.9502
energy: -40.496900809192 hartree
dipole: -0.00010 0.00006 -0.00005 -0.00005 0.00004 -0.00002 -0.00033 0.00033 -0.00000
magnitude: 0.00005 au
magnitude: 0.00013 debye
