program: Gaussian 09
title: 000070349
version: EM64L-G09RevD.01
frameworkgroup: C1[X(C11H12N2O)]
method: RPBEPBE
basis: SDD
operation: Freq
keyword: #p
keyword: freq=noraman
keyword: PBEPBE/SDD
title: #p freq=noraman PBEPBE/SDD
converged: YES YES NO NO
title: Mulliken charges:
elementType: O N N C C C C C C C C C C C H H H H H H H H H H H H
charge: -0.247674 -0.169568 -0.040916 -0.552960 -0.645563 0.217459 0.242279 0.482926 -0.755476 -0.382618 -0.366724 -0.227059 -0.233329 -0.234666 0.234095 0.241660 0.272882 0.271898 0.253279 0.233027 0.231465 0.236266 0.259447 0.225025 0.226806 0.228040
chargesum: 0.00000
title: Mulliken charges with hydrogens summed into heavy atoms:
elementType: O N N C C C C C C C C C C C
charge: -0.247674 -0.169568 -0.040916 -0.077205 -0.100783 0.217459 0.242279 0.482926 -0.037706 -0.146352 -0.107277 -0.002035 -0.006523 -0.006626
polarizability: 1.54096822e+02 -6.88246443e-01 1.35362133e+02 -5.88322484e+00 -7.97499223e+00 9.51477833e+01
1716.lowfreq: -9.0270 -0.0007 -0.0007 0.0006 3.9214 13.2042 20.3513 31.2251 48.0144
frequency: 20.0525 31.0778 47.9839 140.9504 146.9209 166.6326 201.9084 239.0873 288.8796 337.5393 356.8487 403.0251 441.2845 461.0996 508.2925 551.6419 565.9580 600.4596 617.4366 669.7062 706.6065 758.1915 792.7949 816.6298 858.1098 880.0362 891.1768 899.4464 933.5264 981.9419 990.0785 996.9236 999.0855 1026.7594 1028.6095 1040.7258 1074.8492 1099.4157 1118.7496 1172.8915 1184.6729 1189.0200 1210.7892 1266.8222 1311.0851 1336.0082 1349.0705 1363.5952 1385.7596 1401.9118 1403.7146 1443.4541 1452.9383 1454.5939 1458.8526 1485.0462 1567.2205 1595.9418 1614.3107 1641.0692 2974.7161 3017.7363 3023.0341 3047.8233 3071.5375 3085.4831 3106.0163 3121.0768 3125.3807 3136.5287 3147.3477 3163.2955
redmass: 3.9417 4.8454 4.8859 2.7374 1.5068 2.1517 4.4224 4.3853 3.3199 3.4712 2.1761 2.8172 2.3419 3.6642 4.0084 4.5306 5.1778 5.0873 6.2479 4.6105 1.6458 2.7416 3.6893 3.1728 1.2480 3.7224 1.9758 2.2371 1.4930 1.3860 5.7616 1.8855 1.3751 2.2602 1.4903 2.5561 3.5378 1.7515 1.2830 1.0534 1.5401 1.1299 2.7597 2.1408 2.4679 1.4150 1.5418 2.1708 6.1003 1.4494 1.1204 2.1470 1.1293 1.1397 1.0462 2.2231 5.0018 6.0863 6.0502 11.6672 1.0379 1.0618 1.0590 1.0971 1.0997 1.1046 1.0980 1.0848 1.0880 1.0924 1.0966 1.1016
irintensity: 0.1423 1.3796 0.5861 2.0492 7.9561 2.8167 3.2849 5.8558 1.2052 2.2727 2.5685 0.0119 0.1583 0.4469 25.3404 2.4869 8.1236 12.4028 0.1173 42.1994 81.9749 11.8616 2.5646 9.6693 0.5544 9.7444 1.7247 15.6840 6.7236 0.5729 0.1536 4.1341 0.7654 4.0955 8.2974 22.0448 25.4104 4.8419 0.1163 0.0431 17.3473 0.4038 5.9943 61.2796 71.8325 3.0114 20.2883 17.7884 2.9393 21.5344 30.2021 7.7962 28.2198 16.2262 17.6078 11.1754 7.6169 2.4878 2.9665 274.6287 29.8858 1.0638 25.0923 16.4884 2.1137 3.4574 10.3233 2.5098 0.3333 15.3168 35.0502 23.0260
temp: 298.150 k
press: 1.00000 atm
elementType: 8 7 7 6 6 6 6 6 6 6 6 6 6 6 1 1 1 1 1 1 1 1 1 1 1 1
symmnumber: 1
zpe: 544296.0 jmol-1
zpe.correction: 0.207311 hartree
zpe.thermalcorrener: 0.219903 hartree
zpe.thermalcorrenthalpy: 0.220847 hartree
zpe.thermalcorrgfe: 0.166271 hartree
zpe.sumelectzpe: -610.073079 hartree
zpe.sumelectthermal: -610.060487 hartree
zpe.sumelectthermalent: -610.059543 hartree
zpe.sumelectthermalfe: -610.114119 hartree
dipole: -1.5981 -2.5197 -0.8177
dipole: 3.0938
quadrupole: -66.8063 -88.7741 -78.7428
quadrupole: 3.3967 0.9059 0.2369
quadrupole: 11.3014 -10.6664 -0.6351 3.3967 0.9059 0.2369
hfenergy: -610.2803902 hartree
pointgroup: C01 [X(C11H12N2O1)]
dipole: 0.6465358 -0.9521721 0.3961603 debye
dipolederiv: -0.4996947 0.1835665 -0.0368423 0.0854045 -1.2564944 0.0462659 -0.0505326 0.0159028 -0.3630908 -0.5884121 -0.3317678 -0.0377722 0.3699687 -0.976028 0.1659114 -0.0744813 -0.3560383 -0.2842705 -0.1020527 -0.1940419 0.0147724 -0.6219689 0.1862294 -0.2625184 -0.02739 -0.0926189 -0.1853859 0.7572251 0.0513212 0.0407649 0.0105582 0.1070684 -0.02547 0.1206358 0.0184892 0.3837642 -0.2842195 0.1560296 -0.2488985 0.0962562 -0.2526878 -0.0020101 -0.3243629 0.0497276 -0.001063 0.5166057 0.1299855 0.1965642 0.0576354 1.529786 0.0376097 0.2390466 0.3116088 0.2915452 0.1159099 -0.0321851 0.1256906 -0.0527468 0.4071349 0.0341028 0.10807 0.0506633 0.0425954 0.1191146 0.037677 -0.1032109 0.0282276 -0.0112624 0.0041524 -0.0972048 -0.0101049 -0.1179507 -0.0552468 0.0940527 -0.0620102 0.0460363 -0.068417 0.0177901 -0.082213 0.0387369 0.0267769 -0.1197945 -0.0679426 -0.0740919 -0.0473744 0.0075377 0.0764649 -0.0209017 0.0683403 -0.0808174 -0.1374955 0.0658586 -0.0202809 0.0489526 0.0052773 0.015177 0.015031 0.0252761 -0.1198016 -0.0712851 0.0893491 -0.0357139 0.0926267 0.0981897 0.017859 -0.0358255 0.0116789 -0.1109678 -0.0630665 -0.0545789 -0.0813808 -0.0549177 0.0442921 0.088275 -0.0902902 0.1014858 -0.0575923 -0.0048762 0.0418373 -0.1269337 0.0296491 -0.0579282 -0.0018614 -0.1077889 0.0015374 -0.0696014 -0.0099979 -0.0156875 0.0173503 -0.0125141 0.0296558 -0.1593802 -0.0021627 -0.056124 -0.0212992 -0.0082317 -0.0093502 0.0067828 0.0239028 -0.0227399 0.1162092 -0.0016836 0.0014063 0.0863072 0.1354957 0.0287526 0.0215156 -0.0002841 0.1106772 -0.0053658 -0.0161695 -0.0175932 -0.0244661 -0.0041071 -0.0343176 0.0408313 -0.0352541 0.0991431 0.0021096 0.0680348 0.034321 0.1190476 0.0923113 -0.0825916 -0.0360838 -0.0011008 -0.068827 -0.0313913 -0.0187063 -0.0807446 0.0899455 0.0869401 0.0261406 0.0000389 0.0602337 0.0716967 -0.0055028 -0.0535436 0.0444967 -0.1301706 -0.1417911 0.0224276 0.0403632 -0.0176687 0.0633596 0.0500195 0.0755044 0.0173709 0.0922759 0.0795941 0.0679666 0.0896748 0.0622809 0.0069415 -0.0720736 0.0766141 -0.0834405 0.0588598 0.1196919 -0.0895621 0.0293248 -0.0781013 -0.021449 -0.0071998 0.0234153 -0.0004971 0.1157379 0.060517 -0.0861987 0.0317423 -0.1071496 -0.0938808 -0.0129735 0.0417839 -0.0132843 0.1266661 0.0537247 0.0492031 0.0796905 0.0665398 -0.0216305 -0.0957109 0.0958295 -0.090968 0.0657593 -0.0468586 -0.0459441 0.1281125 -0.0491919 0.0843555 0.0095115 0.1392913 0.0103719 0.0671963 unknown
polarizability: 154.1344083|0.5989552|136.3258767|-5.7346939|4.8479499|94.1464532 unknown
InChI: InChI=1S/C11H12N2O/c1-9-7-11(14)13(12-9)8-10-5-3-2-4-6-10/h2-6H,7-8H2,1H3
charge 0 multiplicity 1
26 atoms
O  1.376708 2.57047 -0.126814
N  1.117969 0.2813 -0.692321
N  1.738984 -0.978561 -0.429352
C  -0.123475 0.336444 -1.478097
C  2.947986 0.736313 0.663623
C  1.748215 1.366315 -0.069281
C  2.791124 -0.7390 0.341381
C  -1.373215 0.03219 -0.656711
C  3.690594 -1.842954 0.80851
C  -1.932929 -1.268894 -0.646346
C  -1.981594 1.0538 0.117054
C  -3.084764 -1.547738 0.124305
C  -3.131598 0.776451 0.889091
C  -3.687145 -0.525069 0.893187
H  -0.017072 -0.378536 -2.311743
H  -0.173123 1.360482 -1.889301
H  2.898622 0.950881 1.746505
H  3.898612 1.161036 0.292579
H  3.333435 -2.812043 0.423884
H  3.721966 -1.891668 1.913848
H  4.730552 -1.686553 0.463055
H  -1.461124 -2.063958 -1.236215
H  -1.545675 2.060292 0.114703
H  -3.511241 -2.557262 0.124987
H  -3.595902 1.572653 1.481876
H  -4.581709 -0.739388 1.488994
