program: Orca
programVersion: 5.0.4
elementType: C H H H H
charge: 0
multiplicity: 1
keywords: SP r2SCAN-3C def2-QZVP def2-TZVP/C def2/J TightSCF
keywords: NoFrozenCore
formula: CH4
InChI: InChI=1/CH4/h1H4
5 atoms
C  0.000013 -0.000003 0.000039
H  1.037913 0.266201 -0.180537
H  -0.51515 0.840312 0.457454
H  -0.043518 -0.85777 0.665555
H  -0.479403 -0.248711 -0.942936
totalener: -40.50375095 hartree
nucrepener: 13.47724535 hartree
electener: -53.98099630 hartree
oneelecener: -79.93671503 hartree
twoeener: 25.95571873 hartree
kineticenergy: 40.28179703 hartree
exchangeener: -6.598152584627 hartree
correlationener: -0.280891172727 hartree
xcener: -6.879043757354 hartree
energy: -272.4575 -18.0018 -9.8234 -9.8224 -9.8211 1.4719 3.5762 3.5767 3.5772 4.3005 4.3008 4.3011 10.0363 10.0371 10.0376 10.5130 10.5136 10.6600 12.3670 18.1249 18.1253 18.1264 19.2405 19.2418 19.2418 21.0497 21.0503 21.0511 26.8624 26.8648 26.8664 28.6573 30.2254 30.2265 30.2272 31.1813 31.1832 32.1778 41.9024 41.9050 41.9066 46.5602 46.5606 51.2342 51.2355 51.2358 52.2560 52.2567 52.2570 56.5742 58.8652 58.8667 58.8699 60.1870 60.1892 60.1907 64.4261 64.4311 70.5153 72.1003 72.1009 72.2224 72.2247 72.2276 77.9944 77.9961 77.9984 82.3281 82.3315 82.3344 83.9277 85.8264 85.8297 85.8321 88.2622 88.2672 88.2706 91.4228 91.4268 91.4394 97.0337 106.1476 106.1490 106.1499 108.9818 108.9843 114.0924 114.0928 114.0938 147.3637 147.3665 150.4669 150.4679 150.4686 156.5410 159.6208 159.6221 159.6255 165.8861 165.8877 165.8908 167.2873 169.5703 169.5778 169.5795 172.6852 172.6872 172.6878 177.2033 177.9768 177.9833 177.9901 182.8847 184.2001 184.2075 184.2128 185.4330 185.4344 194.4475 204.1012 204.1048 204.4208 204.4259 204.4336 206.0929 206.0960 206.0988 212.9608 212.9656 212.9670 216.5488 216.5526 216.5665 216.8061 216.8073 221.0622 221.0676 221.0744 224.4567 232.7669 232.7685 232.7699 233.2049 233.2166 233.2202 235.6865 235.6883 235.6914 236.9277 236.9317 236.9333 246.3406 246.3483 246.3615 252.9549 252.9566 252.9630 265.7102 265.7210 269.6936 269.6996 269.7022 276.7379 276.7385 282.2354 282.2726 282.2778 282.2795 295.0383 295.0452 295.0543 324.0712 324.0839 324.0985 383.6576 797.8444 4053.6208 electronvolt
chargesum: -0.0000000
charge: 0.065938 -0.016506 -0.016391 -0.016489 -0.016552
charge: 0.331531 -0.082892 -0.082875 -0.082945 -0.082819
qa: 0.0659 -0.0165 -0.0164 -0.0165 -0.0166
va: 3.8811 1.0213 1.0213 1.0213 1.0213
dispersion: -0.000297474 hartree
energy: -40.501101346109 hartree
dipole: -0.00015 0.00014 -0.00001 0.00003 -0.00004 -0.00001 -0.00043 0.00039 -0.00004
magnitude: 0.00004 au
magnitude: 0.00011 debye
