program: Orca
programVersion: 6.0.0
elementType: C H H H H
charge: 0
multiplicity: 1
keywords: Opt RIJCOSX PBEh-3c
formula: CH4
InChI: InChI=1/CH4/h1H4
5 atoms
C  -4.52016 2.792158 -0.007546
H  -3.482218 3.058266 -0.188022
H  -5.035275 3.632355 0.45006
H  -4.563661 1.934399 0.658106
H  -4.999496 2.543353 -0.950448
totalener: -40.42712165214622 hartree
nucrepener: 13.47731734195512 hartree
electener: -53.90443899410134 hartree
oneelecener: -79.89126002914678 hartree
twoeener: 25.98682103504544 hartree
kineticenergy: 40.08084932820985 hartree
exchangeener: -3.654369045007 hartree
correlationener: -0.399144693291 hartree
xcener: -4.053513738298 hartree
dispersion: -0.000682780 hartree
energy: -283.3701 -21.0968 -12.1202 -12.1199 -12.1193 4.7618 5.9673 5.9677 5.9678 13.8086 13.8090 13.8091 28.2580 28.2590 28.2596 29.0273 electronvolt
chargesum: 0.0000000
charge: -0.881003 0.220246 0.220263 0.220247 0.220247
charge: -0.522565 0.130640 0.130646 0.130639 0.130640
qa: -0.8810 0.2202 0.2203 0.2202 0.2202
va: 3.7476 0.9164 0.9164 0.9164 0.9164
energy: -40.426627761818 hartree
dipole: -0.000007913 -0.000000482 -0.000008395 -0.000181909 0.000150485 -0.000031424 -0.000085222 0.000051644 -0.000033577
dipolemethod: SCF
magnitude: 0.000046748 au
magnitude: 0.000118824 debye
