program: Orca
programVersion: 6.0.0
elementType: C H H H H
charge: 0
multiplicity: 1
keywords: Freq RIJCOSX PBEh-3c
frequency: 0.00 0.00 0.00 0.00 0.00 0.00 1390.62 1390.64 1391.14 1619.84 1620.12 3122.19 3255.27 3255.46 3255.98
frequency: 1390.62 1390.64 1391.14 1619.84 1620.12 3122.19 3255.27 3255.46 3255.98
formula: CH4
InChI: InChI=1/CH4/h1H4
5 atoms
C  -4.52016 2.792151 -0.00755
H  -3.482217 3.058271 -0.188023
H  -5.035272 3.632352 0.450063
H  -4.56366 1.934401 0.658116
H  -4.999501 2.543364 -0.950456
totalener: -40.42712156625316 hartree
nucrepener: 13.47731762799743 hartree
electener: -53.90443919425059 hartree
oneelecener: -79.89282951335278 hartree
twoeener: 25.98839031910219 hartree
kineticenergy: 40.08086504143395 hartree
exchangeener: -3.654475855905 hartree
correlationener: -0.399154211248 hartree
xcener: -4.053630067153 hartree
energy: -283.3596 -21.0934 -12.1173 -12.1170 -12.1165 4.7630 5.9687 5.9691 5.9692 13.8111 13.8115 13.8116 28.2605 28.2614 28.2619 29.0288 electronvolt
chargesum: -0.0000000
charge: -0.880949 0.220232 0.220249 0.220234 0.220235
charge: -0.522546 0.130635 0.130641 0.130634 0.130636
qa: -0.8809 0.2202 0.2202 0.2202 0.2202
va: 3.7476 0.9164 0.9164 0.9164 0.9164
dispersion: -0.000682780 hartree
energy: -40.426627675638 hartree
dipole: -0.000008604 0.000000035 -0.000008569 -0.000152594 0.000127893 -0.000024701 -0.000071574 0.000041171 -0.000030403
dipolemethod: SCF
magnitude: 0.000040099 au
magnitude: 0.000101922 debye
temp: 298.15 k
press: 1.00 atm
zeropoint: 0.04624966 hartree
thermalvibcorrection: 0.00002912 hartree
thermalrotcorrection: 0.00141627 hartree
thermaltrasncorrection: 0.00141627 hartree
thermaltotal: -40.37751635 hartree
thermalcorr: 0.00286166 hartree
nonthermalcorr: 0.04624966 hartree
totalcorr: 0.04911132 hartree
thermalcorrenthalpy: 0.00094421 hartree
totalenthalpy: -40.37657214 hartree
vibrat: 0.00003334 hartree
rotat: 0.00610851 hartree
transl: 0.01627961 hartree
total: 0.02242146 hartree
totalentropycorr: -0.02242146 hartree
gibbsenthalpy: -40.39899361 hartree
gibbsminuselec: 0.02763407 hartree
