program: Orca
programVersion: 5.0.4
elementType: C H H H H
charge: 0
multiplicity: 1
keywords: SP WB97X-D4 def2-QZVP def2-TZVP/C def2/J TightSCF
keywords: NoFrozenCore
formula: CH4
InChI: InChI=1/CH4/h1H4
5 atoms
C  0.000013 -0.000003 0.000039
H  1.037913 0.266201 -0.180537
H  -0.51515 0.840312 0.457454
H  -0.043518 -0.85777 0.665555
H  -0.479403 -0.248711 -0.942936
totalener: -40.56058459 hartree
nucrepener: 13.47724537 hartree
electener: -54.03782996 hartree
oneelecener: -79.90883125 hartree
twoeener: 25.87100128 hartree
kineticenergy: 40.32091142 hartree
exchangeener: -4.182546107910 hartree
correlationener: -0.368370659100 hartree
xcener: -4.550916767010 hartree
energy: -278.9636 -22.5088 -13.6817 -13.6806 -13.6791 2.5730 4.5911 4.5912 4.5914 5.3727 5.3730 5.3731 11.4037 11.4044 11.4053 11.7845 13.0849 13.0855 13.9408 19.8805 19.8811 19.8816 21.0063 21.0075 21.0076 22.3755 22.3760 22.3761 27.6011 27.6033 27.6054 29.7435 31.0626 31.0633 31.0642 31.3901 31.3914 33.4786 41.4405 41.4432 41.4446 48.2369 48.2378 52.0325 52.0340 52.0344 53.4904 53.4908 53.4915 57.3186 59.9055 59.9071 59.9090 60.6738 60.6762 60.6778 64.3609 64.3651 70.0348 71.2806 71.2812 71.5603 71.5632 71.5650 76.9280 76.9295 76.9317 81.0941 81.0981 81.1005 83.5203 84.2613 84.2648 84.2665 88.1972 88.2005 88.2047 89.9847 89.9893 90.0013 95.7967 105.0640 105.0667 105.0678 107.2559 107.2585 113.4140 113.4148 113.4165 145.6545 145.6568 148.8288 148.8298 148.8301 154.8453 157.7008 157.7023 157.7062 163.0882 163.0902 163.0939 163.5277 166.3434 166.3478 166.3502 169.2100 169.2146 169.2160 173.3020 175.0819 175.0885 175.0949 179.9183 180.9480 180.9556 180.9604 183.0681 183.0688 191.1020 199.5932 199.5987 199.6056 200.6062 200.6105 202.3333 202.3365 202.3387 208.6854 208.6908 208.6936 211.4552 211.4571 211.9396 211.9427 211.9545 215.0488 215.0546 215.0608 221.2842 226.0173 228.3881 228.3885 229.0546 229.0564 229.0571 230.6626 230.6649 230.6685 231.4838 231.4868 231.4877 241.2848 241.2913 241.3031 246.6497 246.6514 246.6568 259.0326 259.0425 264.9198 264.9265 264.9295 269.5233 269.5235 275.8540 275.8609 275.8615 277.4048 288.8540 288.8609 288.8695 317.2463 317.2584 317.2703 376.3334 794.8677 4033.0268 electronvolt
chargesum: -0.0000000
charge: -0.153311 0.038425 0.038343 0.038387 0.038155
charge: 0.324684 -0.081175 -0.081166 -0.081231 -0.081112
qa: -0.1533 0.0384 0.0383 0.0384 0.0382
va: 3.9164 1.0097 1.0099 1.0098 1.0098
dispersion: -0.001515051 hartree
energy: -40.562099643950 hartree
dipole: -0.00015 0.00019 0.00004 0.00003 -0.00005 -0.00002 -0.00043 0.00043 -0.00001
magnitude: 0.00004 au
magnitude: 0.00011 debye
