program: Orca
programVersion: 5.0.4
elementType: C H
charge: 0
multiplicity: 2
keywords: SP CCSD(T) aug-cc-pV5Z aug-cc-pV5Z/C TightSCF
keywords: NoFrozenCore
formula: CH
InChI: InChI=1/CH/h1H
2 atoms
C  0.01949 -0.033887 0.07745
H  -0.232246 0.403795 -0.922902
totalener: -38.28437681 hartree
nucrepener: 2.83347642 hartree
electener: -41.11785323 hartree
oneelecener: -56.60805345 hartree
twoeener: 15.49020022 hartree
kineticenergy: 38.26400208 hartree
s2: 0.759750
energy: -308.1982 -23.9273 -12.8793 -11.5807 0.4760 0.6167 1.7849 1.8289 2.3036 2.9288 4.4519 5.0236 5.0529 5.7067 5.7101 6.7895 7.1026 7.2073 8.0160 8.1967 8.6052 9.3556 11.2749 13.5678 13.6644 14.6428 14.6434 15.1524 15.1526 16.5522 16.5567 17.4770 17.9085 18.0432 18.2001 18.4760 19.9471 19.9726 19.9781 20.0687 20.9462 25.9933 26.5433 26.8860 29.8468 29.9697 33.7349 33.7349 35.7950 36.1225 37.8365 37.8399 38.1976 38.3445 39.7765 42.5880 42.5880 43.6611 43.6650 44.5701 44.5708 45.1943 45.3452 46.5245 46.5270 47.7043 47.7668 48.0765 48.7977 48.8019 49.3987 49.4206 49.8041 56.4404 56.6836 56.7706 64.1320 69.3596 69.5149 73.6436 74.6052 74.6057 74.8015 75.0011 81.5533 81.5533 82.3739 86.2432 86.4609 89.3459 89.3544 90.6467 94.0081 94.0081 94.8685 94.8685 95.9523 96.1487 96.7899 98.8393 98.8395 103.5665 103.5665 107.1399 107.6703 107.6834 109.3721 109.8101 110.9401 110.9401 111.3433 111.3444 112.1245 112.1420 112.9068 112.9074 115.8380 117.6440 117.6471 118.7021 119.3080 121.4961 121.9648 127.3854 131.8622 131.8642 133.1363 142.9565 143.1195 143.1304 143.2157 152.7478 160.4329 160.4339 166.2131 166.5355 168.2700 176.1337 176.6294 176.6450 187.0184 187.4207 205.2666 212.0635 212.4541 234.1162 240.7975 241.1746 242.9196 242.9196 244.8390 244.8390 245.4655 245.4658 255.2574 255.2696 257.5228 258.2680 267.6581 274.3128 274.3128 279.6505 281.7114 281.7140 282.3307 282.3500 282.9681 283.6579 284.9581 284.9823 290.7830 291.4329 291.4503 315.9876 317.3146 317.9988 326.9461 326.9488 349.5813 350.1097 357.8760 358.6243 358.6243 359.6506 359.6506 371.5641 371.5641 380.7483 380.7488 390.3692 390.3694 395.0025 395.2449 400.7436 404.4673 404.7403 411.1527 414.4867 414.4889 431.7806 482.1280 482.5006 486.2390 486.4057 514.6990 559.8381 1047.6439 electronvolt
energy: -307.5705 -21.3641 -11.8437 0.6395 0.7536 1.3029 1.8445 2.5157 3.0245 3.3479 4.4948 5.0638 5.2599 5.8276 5.8280 6.8299 7.2282 7.3922 8.1157 8.4035 9.5557 10.2970 11.4992 13.6749 13.9734 14.7647 14.7654 15.2688 15.2691 16.8074 16.8344 17.6074 18.0348 18.0563 18.2673 18.7305 20.0994 20.4408 20.5100 20.5978 21.3108 26.6604 27.1515 28.1964 29.8435 30.2037 33.8189 33.8191 35.9827 36.2703 37.8918 37.8949 38.2152 38.5000 40.0486 42.8076 42.8076 44.1136 44.1266 45.0594 45.0637 45.4862 46.4006 47.0632 47.2390 47.7630 48.0078 48.2748 48.9952 49.0040 49.6297 50.1246 50.6199 56.4685 57.0412 57.0656 64.3375 69.6846 70.6145 73.8443 74.7983 74.8101 74.8977 75.7170 81.6594 81.6594 82.6428 86.2800 86.7557 89.4286 89.4421 90.7354 94.0308 94.0310 95.1505 95.1505 96.1062 97.0870 97.1092 99.0626 99.0630 103.7450 103.7450 107.3154 108.1808 108.2418 109.3939 110.1857 111.4663 111.4664 112.2625 112.2694 112.3576 112.3785 113.2349 113.2390 115.9688 118.3661 118.3798 118.7557 119.6058 121.6065 122.5556 127.6677 132.5880 132.6423 133.5113 143.0046 143.2725 143.2890 143.6402 153.0056 160.4773 160.4788 166.2999 167.0980 168.4062 176.3775 176.8536 176.8892 187.0259 187.6031 205.3571 212.1030 212.7418 234.5204 241.0387 242.4432 243.4123 243.4124 245.2482 245.2482 245.8065 245.8076 255.5426 255.5647 257.5962 258.6239 267.8522 275.1711 275.1716 280.0396 282.2354 282.2529 282.8817 282.9128 283.0576 284.1028 285.5337 285.5968 291.1125 291.9656 292.0129 316.1648 317.4380 318.5618 327.7363 327.7464 349.7236 350.7633 358.0917 358.6328 358.6328 359.6425 359.6425 371.6036 371.6036 380.7885 380.7894 390.3503 390.3506 394.9905 395.2875 400.7546 404.4561 404.8122 411.1393 414.5413 414.5443 431.8022 482.1471 482.6353 486.1970 486.4023 514.7446 559.8396 1047.8878 electronvolt
e0: -38.284376913 hartree
ecorr: -0.165572110 hartree
corrType: UHF
chargesum: 0.0000000
charge: -0.247541 0.247541
charge: 0.789290 -0.789290
qa: -0.2475 0.2475
va: 2.1812 0.8310
energy: -38.454211152683 hartree
dipole: -0.21789 0.09136 -0.12653 0.37883 -0.15884 0.21999 -0.86584 0.36304 -0.50280
magnitude: 0.56322 au
magnitude: 1.43159 debye
dipolemethod: MDCI
