program: Orca
programVersion: 5.0.4
elementType: C H
charge: 0
multiplicity: 2
keywords: Opt RIJCOSX PBEh-3c
formula: CH
InChI: InChI=1/CH/h1H
2 atoms
C  -4.702892 2.493464 -0.136589
H  -4.954628 2.931146 -1.136941
totalener: -38.38203007 hartree
nucrepener: 2.93244759 hartree
electener: -41.31447765 hartree
oneelecener: -56.82394810 hartree
twoeener: 15.50947045 hartree
kineticenergy: 38.21313548 hartree
exchangeener: -3.009449384544 hartree
correlationener: -0.260684000396 hartree
xcener: -3.270133384941 hartree
s2: 0.752583
dispersion: -0.000138847 hartree
s2: 0.752641
dispersion: -0.000138911 hartree
s2: 0.752648
dispersion: -0.000138919 hartree
energy: -286.8841 -19.7056 -10.0406 -8.3522 -2.7276 4.7868 13.7396 14.3180 14.7743 18.9861 26.6425 46.3750 46.5371 46.7136 46.7271 58.4446 360.8685 electronvolt
energy: -286.4379 -18.2231 -9.3183 -2.1417 -0.7513 5.1262 14.6619 15.1805 16.2680 19.7425 27.0735 46.9972 48.2803 48.6388 48.6831 59.1944 361.4936 electronvolt
chargesum: -0.0000000
charge: -0.160458 0.160458
charge: -0.087914 0.087914
qa: -0.1605 0.1605
va: 1.9132 0.9097
dispersion: -0.000138920 hartree
energy: -38.382712466976 hartree
dipole: -0.21789 0.07940 -0.13849 0.37883 -0.13805 0.24079 -0.86584 0.31556 -0.55028
magnitude: 0.61642 au
magnitude: 1.56681 debye
