program: Orca
programVersion: 5.0.4
elementType: C H
charge: 0
multiplicity: 2
keywords: Opt RIJCOSX PBEh-3c
formula: CH
InChI: InChI=1/CH/h1H
2 atoms
C  0.560276 0.0000 0.0000
H  -0.560276 0.0000 0.0000
totalener: -38.38279298 hartree
nucrepener: 2.86816915 hartree
electener: -41.25096214 hartree
oneelecener: -56.70596599 hartree
twoeener: 15.45500385 hartree
kineticenergy: 38.18374729 hartree
exchangeener: -3.004541240573 hartree
correlationener: -0.260285025626 hartree
xcener: -3.264826266199 hartree
s2: 0.752623
dispersion: -0.000138887 hartree
s2: 0.752646
dispersion: -0.000138918 hartree
s2: 0.752648
dispersion: -0.000138920 hartree
energy: -286.8839 -19.7056 -10.0405 -8.3523 -2.7277 4.7867 13.7407 14.3180 14.7750 18.9867 26.6431 46.3760 46.5375 46.7148 46.7277 58.4449 360.8683 electronvolt
energy: -286.4377 -18.2232 -9.3182 -2.1419 -0.7513 5.1261 14.6620 15.1812 16.2684 19.7427 27.0738 46.9980 48.2809 48.6392 48.6831 59.1947 361.4934 electronvolt
chargesum: -0.0000000
charge: -0.160512 0.160512
charge: -0.087939 0.087939
qa: -0.1605 0.1605
va: 1.9132 0.9097
energy: -38.382713171450 hartree
dipole: -0.96988 0.35335 -0.61653 0.00000 -0.00000 -0.00000 0.00000 -0.00000 -0.00000
magnitude: 0.61653 au
magnitude: 1.56708 debye
