program: Orca
programVersion: 5.0.4
elementType: C H
charge: 0
multiplicity: 2
keywords: Freq RIJCOSX PBEh-3c
frequency: 0.00 0.00 0.00 0.00 0.00 2933.91
frequency: 2933.91
formula: CH
InChI: InChI=1/CH/h1H
2 atoms
C  0.086757 0.0000 0.0000
H  -1.033796 0.0000 0.0000
totalener: -38.38291306 hartree
nucrepener: 2.83348092 hartree
electener: -41.21639397 hartree
oneelecener: -56.64192048 hartree
twoeener: 15.42552651 hartree
kineticenergy: 38.16839366 hartree
exchangeener: -3.001908431499 hartree
correlationener: -0.260065251668 hartree
xcener: -3.261973683167 hartree
s2: 0.752651
energy: -286.8858 -19.7052 -10.0406 -8.3547 -2.7281 4.7870 13.7389 14.3187 14.7750 18.9868 26.6433 46.3752 46.5362 46.7137 46.7282 58.4449 360.8666 electronvolt
energy: -286.4387 -18.2215 -9.3184 -2.1422 -0.7510 5.1275 14.6612 15.1812 16.2692 19.7431 27.0765 46.9969 48.2807 48.6394 48.6841 59.1950 361.4927 electronvolt
chargesum: -0.0000000
charge: -0.160494 0.160494
charge: -0.087931 0.087931
qa: -0.1605 0.1605
va: 1.9133 0.9097
dispersion: -0.000138920 hartree
energy: -38.382714006287 hartree
dipole: -0.96988 0.35324 -0.61664 0.00000 0.00000 0.00000 0.00000 -0.00000 -0.00000
magnitude: 0.61664 au
magnitude: 1.56737 debye
temp: 298.15 k
press: 1.00 atm
zeropoint: 0.00668394 hartree
thermalvibcorrection: 0.00000001 hartree
thermalrotcorrection: 0.00094418 hartree
thermaltrasncorrection: 0.00141627 hartree
thermaltotal: -38.37366960 hartree
thermalcorr: 0.00236046 hartree
nonthermalcorr: 0.00668394 hartree
totalcorr: 0.00904441 hartree
thermalcorrenthalpy: 0.00094421 hartree
totalenthalpy: -38.37272539 hartree
vibrat: 0.00000001 hartree
rotat: 0.00345951 hartree
transl: 0.01598380 hartree
total: 0.02009778 hartree
totalentropycorr: -0.02009778 hartree
gibbsenthalpy: -38.39282317 hartree
gibbsminuselec: -0.01010916 hartree
