program: Orca
programVersion: 5.0.4
elementType: C H H H
charge: 0
multiplicity: 2
keywords: SP CCSD(T) aug-cc-pVQZ def2-TZVP/C def2/J TightSCF
keywords: NoFrozenCore
formula: CH3
InChI: InChI=1/CH3/h1H3
4 atoms
C  -0.000061 -0.000008 0.000065
H  1.009514 0.344733 0.091137
H  -0.504495 -0.410977 0.850309
H  -0.504286 0.066345 -0.942224
totalener: -39.58053500 hartree
nucrepener: 9.75226109 hartree
electener: -49.33279608 hartree
oneelecener: -71.72387362 hartree
twoeener: 22.39107753 hartree
kineticenergy: 39.57661977 hartree
s2: 0.761480
energy: -305.6145 -25.8674 -15.8869 -15.8798 -10.4576 0.7520 1.1783 1.1787 2.1488 3.2068 3.2083 3.4040 5.0006 5.0007 5.4860 5.8955 5.8962 7.1314 7.4963 7.4972 7.5587 7.6369 8.2011 8.2023 9.0401 10.2038 10.2064 10.4879 10.4885 12.9758 12.9791 13.3974 14.5427 15.9288 15.9313 18.3757 18.4455 19.2086 19.2112 19.4320 20.0036 20.3752 20.3759 20.5907 20.5930 21.0553 21.5327 21.5369 21.6885 24.2477 24.5541 24.5606 25.1599 25.1635 27.1634 27.1707 29.6769 30.2290 30.2309 30.2996 30.3079 30.7707 33.1393 35.8876 38.5292 38.5307 38.9875 40.6366 40.8801 40.8832 43.0356 43.0491 46.7866 46.8119 47.3211 47.7120 48.0452 48.2786 48.2919 49.4617 49.4673 50.2136 52.9512 53.6527 54.2783 54.2845 55.5504 55.5513 56.3599 56.3644 56.4890 57.1683 57.1686 58.7322 58.7482 60.5723 60.5890 61.5465 61.5507 62.9181 63.1608 63.1646 66.8035 66.8080 68.7089 70.2535 71.5161 71.5180 72.4112 73.1809 76.3556 76.3584 76.4698 76.4715 78.8181 80.6437 80.6760 82.9722 88.6619 88.6716 90.2626 94.9829 94.9925 97.9190 97.9324 98.9597 102.4120 103.0094 103.0185 105.6996 105.7094 108.0725 111.2923 113.9452 114.4483 114.4586 117.0309 117.0355 120.9527 121.7443 121.7470 129.2136 130.7489 130.7637 134.1582 159.3423 162.4016 163.2356 163.6325 163.6499 165.4582 165.4688 170.6959 171.9208 171.9282 174.2865 174.2966 176.6398 183.0003 183.9435 183.9484 184.6041 186.3115 187.5548 187.5619 188.5089 188.5142 193.9800 197.7781 197.8227 198.4860 201.3752 201.3950 207.2212 207.2472 210.9213 210.9745 217.7992 217.8323 221.1560 227.5173 227.5234 231.0561 231.0977 232.2886 234.3176 235.2230 235.2411 238.3421 242.4356 247.2690 247.2758 250.6393 252.4236 252.4309 252.4907 252.5014 263.3688 264.5215 264.5305 266.7932 269.3097 269.4423 277.7726 277.7936 282.7825 282.7945 287.4656 287.8650 291.4321 291.4625 298.8395 322.7201 322.8520 337.7987 359.6063 359.6477 734.7482 electronvolt
energy: -304.9947 -23.4204 -15.5038 -15.4963 0.7841 1.1836 1.1841 1.5289 3.2216 3.2231 3.5246 3.9091 5.0343 5.0344 5.8099 6.0778 6.0784 7.5009 7.5018 7.5560 7.6754 8.0876 8.2367 8.2380 9.3573 10.2255 10.2284 10.6177 10.6188 13.0336 13.0369 15.2755 15.5084 16.4408 16.4432 18.3483 18.7001 19.2959 19.2986 19.6481 20.1549 20.4911 20.4920 20.7361 20.7384 21.3665 21.6566 21.6606 21.7231 24.4454 24.5801 24.5865 25.8780 25.8813 27.2885 27.2960 29.6993 30.4156 30.4175 30.5036 30.5119 30.7943 34.4585 36.7531 38.6770 38.6785 38.9341 41.0113 41.0144 41.2535 43.0161 43.0297 46.9248 46.9501 47.5775 47.7056 48.3122 48.3258 48.5745 49.4747 49.4803 50.2470 52.9974 53.6638 54.4426 54.4489 55.6518 55.6529 56.5428 56.5483 56.5552 58.2085 58.2097 58.9353 59.7130 60.6780 60.6944 61.9572 61.9605 63.2973 63.4764 63.4795 67.1322 67.1367 69.2727 70.4461 71.7614 71.7632 73.5174 73.5901 76.6705 76.6728 76.6732 76.6743 78.8188 80.7593 80.7919 83.3058 88.6955 88.7046 90.5263 95.0841 95.0937 98.1897 98.2027 98.9669 102.6680 103.3124 103.3216 105.7982 105.8080 108.2883 111.3394 114.0337 114.5680 114.5783 117.6795 117.6844 121.2226 121.8184 121.8213 129.8113 130.8244 130.8388 134.2507 160.0551 163.0660 163.5601 164.0066 164.0240 166.0157 166.0262 171.9238 172.5001 172.5075 174.9326 174.9433 176.7420 183.4206 184.0183 184.0230 184.6198 187.0125 187.5931 187.6031 188.8846 188.8869 194.1619 197.9337 197.9788 198.7001 201.4677 201.4871 207.8738 207.9011 211.2241 211.2758 217.9242 217.9570 221.2539 227.5714 227.5774 231.0643 231.1057 232.3395 234.3916 235.3057 235.3234 238.3155 242.5442 247.2630 247.2698 250.7318 252.4726 252.4797 252.5420 252.5527 263.3837 264.4967 264.5056 266.8576 269.2509 269.5131 277.7179 277.7391 283.0002 283.0122 287.4835 288.1794 291.4864 291.5172 298.9232 322.7481 322.8801 337.8688 359.6436 359.6852 735.1186 electronvolt
e0: -39.580534103 hartree
ecorr: -0.216927445 hartree
corrType: UHF
chargesum: 0.0000000
charge: -0.991253 0.330225 0.330744 0.330284
charge: 1.219296 -0.406484 -0.406450 -0.406362
qa: -0.9913 0.3302 0.3307 0.3303
va: 3.6954 0.9599 0.9596 0.9599
energy: -39.803054134348 hartree
dipole: 0.00069 -0.00059 0.00010 0.00009 -0.00016 -0.00007 -0.00073 0.00065 -0.00008
magnitude: 0.00015 au
magnitude: 0.00037 debye
dipolemethod: MDCI
