program: Gaussian 09
title: 000070343
version: EM64L-G09RevD.01
frameworkgroup: C1[X(C10H12O3)]
method: RPBEPBE
basis: SDD
operation: Freq
keyword: #pfreq=noraman
keyword: PBEPBE/SDD
title: #p freq=noraman PBEPBE/SDD
converged: YES YES NO NO
title: Mulliken charges:
elementType: O O O C C C C C C C C C C H H H H H H H H H H H H
charge: -0.305544 -0.434734 -0.183209 0.234259 -0.699266 -0.699377 0.127212 0.307546 -0.334454 -0.334759 -0.212429 -0.212297 -0.243632 0.248728 0.238002 0.229833 0.229765 0.248924 0.237946 0.243538 0.243671 0.228223 0.228227 0.230045 0.383779
chargesum: 0.00000
title: Mulliken charges with hydrogens summed into heavy atoms:
elementType: O O O C C C C C C C C C C
charge: -0.305544 -0.050955 -0.183209 0.234259 0.017297 0.017259 0.127212 0.307546 -0.090915 -0.091088 0.015793 0.015931 -0.013587
polarizability: 1.54681290e+02 -8.62301286e-03 1.07416958e+02 -4.24103594e+00 -8.19944044e-02 7.92095750e+01
1716.lowfreq: -12.8933 0.0008 0.0008 0.0011 11.6956 16.8916 24.4143 40.8792 75.4875
frequency: 22.8046 40.8619 75.4188 84.3358 187.5922 215.9602 255.5435 256.8389 275.3132 307.4609 318.7612 333.0701 414.3965 423.9901 436.5508 521.0595 537.2633 577.9928 604.4741 611.4781 680.0142 699.5970 722.2985 763.4113 779.0726 840.1384 869.3802 909.5412 925.5051 936.7136 969.1446 988.7193 989.3660 1003.0008 1014.1129 1019.9272 1071.4688 1154.0624 1166.4290 1169.2114 1172.0760 1192.1105 1206.0635 1292.9941 1299.4586 1371.4476 1373.8626 1391.1869 1434.5544 1458.5900 1464.9796 1468.7273 1476.6359 1487.7649 1589.6313 1598.6994 1685.5858 2997.1227 2998.9201 3097.5575 3100.7473 3108.4952 3113.9216 3127.6984 3136.7138 3153.6066 3162.5203 3171.7616 3521.5435
redmass: 4.4705 6.8651 4.5974 5.0434 5.9452 1.4149 1.6377 4.1850 1.0179 3.5776 3.6504 3.0008 2.9902 4.6744 4.6514 3.7274 4.3240 1.1810 4.3474 6.4910 4.4780 1.8267 5.3892 3.1299 2.1282 1.2377 3.5538 1.5286 1.5183 2.2362 1.3663 3.2727 1.6101 1.2958 3.1841 2.0608 1.5206 2.3590 1.3421 1.0786 3.6208 2.3552 1.8576 2.6065 1.3629 1.1981 8.1678 1.2050 2.1930 1.0503 1.0507 2.0749 1.1052 1.0602 6.5000 6.1419 9.6829 1.0345 1.0351 1.1012 1.1004 1.1004 1.0996 1.0848 1.0891 1.0930 1.0959 1.1007 1.0642
irintensity: 0.0052 0.1140 1.7882 1.5740 0.4561 0.0037 0.0100 0.2503 0.7667 0.2722 5.8145 2.8539 0.2142 5.1973 1.9913 11.5823 27.9618 130.0795 15.4375 0.0739 7.9655 44.4503 25.0688 7.1144 64.7924 0.0045 16.8609 4.1302 0.3580 39.0907 0.0418 0.8269 0.3813 0.1458 360.8569 38.1141 14.4011 153.0938 4.2959 0.8802 15.8039 71.2512 9.2791 15.1278 0.3156 27.9151 0.4397 11.6248 3.6418 1.3414 2.7019 72.0802 18.8382 24.6069 7.2032 35.4943 228.2846 13.5764 5.9501 10.6062 26.2543 2.7858 28.7706 1.0049 9.4461 31.0174 22.3499 5.2860 26.6503
temp: 298.150 k
press: 1.00000 atm
elementType: 8 8 8 6 6 6 6 6 6 6 6 6 6 1 1 1 1 1 1 1 1 1 1 1 1
symmnumber: 1
zpe: 519342.3 jmol-1
zpe.correction: 0.197807 hartree
zpe.thermalcorrener: 0.210637 hartree
zpe.thermalcorrenthalpy: 0.211581 hartree
zpe.thermalcorrgfe: 0.157600 hartree
zpe.sumelectzpe: -612.952884 hartree
zpe.sumelectthermal: -612.940055 hartree
zpe.sumelectthermalent: -612.939110 hartree
zpe.sumelectthermalfe: -612.993092 hartree
dipole: -0.1607 0.0255 3.2653
dipole: 3.2693
quadrupole: -62.6626 -69.3103 -86.6352
quadrupole: 0.0261 2.8614 -0.1110
quadrupole: 10.2068 3.5591 -13.7658 0.0261 2.8614 -0.1110
hfenergy: -613.1506914 hartree
pointgroup: C01 [X(C10H12O3)]
dipole: 0.0875682 -0.060117 -1.2818522 debye
dipolederiv: -1.5134889 -0.0106247 -0.2222212 -0.0006495 -0.4308948 0.0034977 -0.0397302 0.0038619 -0.3495709 -1.027836 -0.0224583 -0.4804568 -0.0202154 -0.3998611 -0.0103183 -0.423577 -0.0101104 -0.6108926 -0.6533584 0.0108663 0.2397761 -0.0021477 -0.2576988 -0.0317831 -0.0372242 -0.0324484 -0.9521978 0.687787 0.0127437 0.2705365 0.0301487 0.4349519 -0.0069909 0.6578201 -0.0069541 0.2817847 -0.1386678 0.0110957 0.0080625 -0.058398 -0.0989629 -0.0744757 -0.134382 -0.0861675 -0.0487068 -0.1388752 -0.0100119 0.0082795 0.0457214 -0.0835224 0.0781537 -0.1395764 0.0896559 -0.0646429 1.4481771 0.0027331 0.0453438 0.0075933 0.1215492 0.0578679 0.1413648 0.0582727 1.3688645 1.3240389 0.004368 0.0879938 -0.0136279 0.2054768 -0.0109649 -0.2836057 -0.0113997 -0.0254849 -0.2511338 -0.0501591 -0.0404285 -0.1738364 -0.0200339 0.0131571 -0.0145011 0.0050084 -0.1384106 -0.2515892 0.0458192 -0.0452885 0.1711287 -0.0227133 -0.0248603 -0.0323926 -0.0164934 -0.1354629 0.0457672 0.0385477 -0.0359289 0.0695177 0.1097497 -0.0161511 -0.042492 -0.0113408 -0.1401502 0.0460577 -0.0421675 -0.031844 -0.0734405 0.1098426 -0.0089572 -0.0353543 -0.0139568 -0.1403818 0.0430608 -0.0026102 -0.054362 -0.0015272 -0.1163727 -0.0025256 -0.0314974 -0.0024915 -0.1649452 -0.0093867 -0.0238778 -0.1121911 -0.0226703 0.0997569 0.0074951 -0.131444 -0.0200878 0.0150475 -0.0466167 0.0236176 0.1127175 0.0143349 0.057516 -0.0088215 0.151322 0.0093314 0.0562513 0.1210068 0.0165901 0.011569 0.0054384 -0.0627674 0.0722237 0.0204213 0.1133685 0.0075328 0.1212419 -0.0158148 0.0130843 -0.0039374 -0.0795564 -0.0640768 0.0206263 -0.1050982 0.0242278 -0.0098261 0.0133802 -0.1139038 0.0102264 0.1003648 -0.0156947 -0.1327803 0.0117942 0.0156273 -0.0461649 -0.0129675 0.1148215 0.0001491 0.0574744 0.0086501 0.1521781 -0.0093921 0.0558707 0.0531584 0.0936901 0.0267123 0.0919853 -0.0245037 0.0004825 0.0350977 -0.0005845 0.1480526 0.0533558 -0.0904319 0.0357897 -0.08777 -0.0227328 0.0166246 0.0438788 0.017642 0.146482 0.019392 -0.0841232 0.016864 -0.1009391 -0.0694157 0.019242 0.0267782 0.020916 0.1522223 0.0191341 0.0856058 0.0083669 0.1032319 -0.0709518 0.0032155 0.016612 0.0015989 0.1539889 -0.1283946 0.0020157 0.0425331 0.0024306 0.0880228 0.00356 0.0512571 0.0035898 0.1580815 0.2331607 0.0041735 0.0941742 0.0072531 0.3752827 -0.0085498 0.1612009 -0.0085147 0.1868126 unknown
polarizability: 154.8149761|-0.1341608|107.3411842|-2.8037419|-1.4658025|79.1516622 unknown
InChI: InChI=1S/C10H12O3/c1-10(2,9(11)12)13-8-6-4-3-5-7-8/h3-7,11H,1-2H3
charge 0 multiplicity 1
25 atoms
O  -0.389878 0.031447 0.71488
O  -3.801484 -0.030572 -0.557072
O  -2.936699 0.069378 1.595117
C  -1.396421 -0.020494 -0.386214
C  -1.282422 -1.338757 -1.188386
C  -1.284992 1.21648 -1.308646
C  -2.738925 0.013283 0.370121
C  0.986201 0.015517 0.366849
C  1.682164 1.236918 0.198642
C  1.683663 -1.215674 0.321532
C  3.075569 1.221331 -0.036037
C  3.07706 -1.221869 0.086533
C  3.776303 -0.006054 -0.09878
H  -2.089184 -1.394785 -1.937366
H  -0.309739 -1.376616 -1.708754
H  -1.359977 -2.211647 -0.517593
H  -1.360747 2.148514 -0.722572
H  -2.094518 1.201378 -2.056542
H  -0.314177 1.205132 -1.833622
H  1.13338 2.180622 0.280104
H  1.135782 -2.147103 0.496543
H  3.613909 2.167744 -0.159565
H  3.616713 -2.175143 0.058297
H  4.857154 -0.014277 -0.276494
H  -4.662136 -0.008554 -0.057873
