program: Orca
programVersion: 5.0.4
elementType: C H H H
charge: 0
multiplicity: 2
keywords: RIJCOSX NumFreq NoFrozenCore MP2 DEF2-QZVPP DEF2-QZVPP/C
frequency: 0.00 0.00 0.00 0.00 0.00 0.00 500.73 1433.24 1434.16 3189.09 3380.68 3381.88
frequency: 500.73 1433.24 1434.16 3189.09 3380.68 3381.88
formula: CH3
InChI: InChI=1/CH3/h1H3
4 atoms
C  -5.592194 1.965343 -0.06448
H  -4.581917 2.30943 0.026474
H  -6.096464 1.553447 0.785968
H  -6.096335 2.03099 -1.007382
totalener: -39.58105290 hartree
nucrepener: 9.74819528 hartree
electener: -49.32924817 hartree
oneelecener: -71.71831369 hartree
twoeener: 22.38906551 hartree
kineticenergy: 39.57482728 hartree
s2: 0.761469
energy: -305.6123 -25.8600 -15.8817 -15.8746 -10.4583 3.0962 4.8730 4.8742 5.8971 5.8992 6.0551 9.2842 13.1387 13.5315 13.5383 15.2922 15.2946 20.4378 20.8315 20.8372 21.2158 24.2861 24.9636 24.9653 25.1530 25.1613 25.6589 27.4347 29.7544 29.7586 35.8047 35.8798 35.8848 40.4741 40.4774 51.9448 52.0541 52.0586 53.4887 57.2589 57.2661 57.2774 57.2874 57.9169 58.9093 61.4471 64.1293 64.1419 68.9382 68.9406 71.8183 72.4527 72.4632 72.4678 74.9471 74.9505 78.4817 79.0863 79.0894 80.2726 82.2933 83.1740 83.1923 91.0999 96.9913 97.0025 100.3282 100.3349 103.5708 105.6695 111.0639 111.0691 114.4778 114.4993 117.6066 147.2085 149.4591 149.4848 150.5228 152.4511 152.4606 159.6380 159.6508 160.1640 162.0154 166.1864 166.2098 169.1274 170.6719 171.1727 171.1788 171.2019 173.9663 173.9841 183.3230 184.3549 184.3580 185.4490 192.9936 193.0351 193.2743 193.2917 197.3925 202.1601 202.1780 205.3109 205.3639 208.9346 208.9437 211.6124 212.6097 214.8527 214.8623 215.0230 215.0266 216.1236 226.9058 230.0003 231.1797 233.7210 233.7270 233.7471 233.7530 235.4401 235.4769 239.4490 239.4505 239.4886 247.8760 252.3043 256.7135 259.6976 259.7340 269.5763 269.6339 278.5445 280.9825 280.9986 283.2834 294.9300 313.3132 313.3707 320.6468 320.7479 377.5757 808.5620 4085.2086 electronvolt
energy: -304.9948 -23.4116 -15.4987 -15.4911 2.5392 3.2832 4.9548 4.9561 5.9126 5.9149 8.6263 10.0895 13.7311 13.7379 13.8892 16.3928 16.3950 20.9198 20.9254 21.1633 21.2925 24.7790 25.3812 25.3834 25.4565 25.4661 27.5949 28.0655 29.7726 29.7768 36.0141 36.0173 36.3636 40.6879 40.6915 53.1883 53.4587 53.4634 53.4778 57.5821 57.5923 57.7928 57.8001 58.7669 59.2690 61.5629 64.6695 64.6837 69.0893 69.0922 72.0210 72.7010 72.7051 72.7736 74.8939 74.8973 79.1553 79.1582 79.8308 80.2886 82.3032 83.3899 83.4071 91.8824 97.0946 97.1052 100.9653 100.9714 104.4591 106.2234 111.2769 111.2824 114.6938 114.7130 117.6634 147.8299 149.8213 149.8479 150.8532 153.1513 153.1611 160.1884 160.2024 160.8925 162.1343 166.8547 166.8802 169.5298 170.6810 171.3313 171.3365 171.3497 174.0617 174.0801 183.6020 184.5626 184.5659 185.6592 193.1208 193.1619 194.1078 194.1254 198.3937 202.2420 202.2584 205.4097 205.4620 208.9199 208.9287 211.6822 212.6035 214.9719 214.9819 215.1958 215.1983 216.3352 226.9785 229.9792 231.1465 233.7105 233.7146 233.7401 233.7506 235.5089 235.5470 239.4722 239.4743 239.6743 247.9085 252.4438 256.6536 259.7390 259.7746 269.5730 269.6292 278.5890 281.2045 281.2205 283.6289 295.0133 313.4301 313.4891 320.6649 320.7652 377.8017 808.8230 4085.2942 electronvolt
chargesum: -0.0000000
charge: -0.349151 0.116762 0.116534 0.115854
charge: 0.417726 -0.139244 -0.139293 -0.139189
qa: -0.3492 0.1168 0.1165 0.1159
va: 3.9834 1.0089 1.0091 1.0093
energy: -39.773075316667 hartree
dipole: 0.00140 -0.00101 0.00039 -0.00162 0.00084 -0.00078 -0.00112 0.00104 -0.00008
magnitude: 0.00087 au
magnitude: 0.00222 debye
dipolemethod: MP2 RELAXED
temp: 298.15 k
press: 1.00 atm
zeropoint: 0.03034468 hartree
thermalvibcorrection: 0.00023653 hartree
thermalrotcorrection: 0.00141627 hartree
thermaltrasncorrection: 0.00141627 hartree
thermaltotal: -39.73966157 hartree
thermalcorr: 0.00306907 hartree
nonthermalcorr: 0.03034468 hartree
totalcorr: 0.03341375 hartree
thermalcorrenthalpy: 0.00094421 hartree
totalenthalpy: -39.73871736 hartree
vibrat: 0.00032712 hartree
rotat: 0.00661756 hartree
transl: 0.01618771 hartree
total: 0.02378684 hartree
totalentropycorr: -0.02378684 hartree
gibbsenthalpy: -39.76250420 hartree
gibbsminuselec: 0.01057111 hartree
