program: Orca
programVersion: 5.0.4
elementType: C H H H H
charge: 0
multiplicity: 1
keywords: SP CCSD(T) aug-cc-pVQZ def2-TZVP/C def2/J TightSCF
keywords: NoFrozenCore
formula: CH4
InChI: InChI=1/CH4/h1H4
5 atoms
C  -0.000008 -0.000003 -0.000002
H  1.040138 0.266736 -0.180854
H  -0.516174 0.842028 0.458648
H  -0.043561 -0.859498 0.667183
H  -0.480308 -0.249227 -0.944957
totalener: -40.21620065 hartree
nucrepener: 13.44859440 hartree
electener: -53.66479505 hartree
oneelecener: -79.76268597 hartree
twoeener: 26.09789091 hartree
kineticenergy: 40.16992247 hartree
energy: -304.9265 -25.6525 -14.8296 -14.8291 -14.8289 0.7463 1.2291 1.2291 1.2291 2.8927 2.8928 2.8928 3.3565 5.0325 5.0326 5.0326 5.6321 5.6322 7.2944 7.3864 7.3864 7.3865 7.6269 7.6269 7.6269 7.9525 7.9526 7.9526 9.0499 10.6647 10.6648 10.6649 10.6835 10.6837 14.8863 14.8864 14.8866 15.0904 15.0905 16.5163 18.5733 18.5734 18.5735 19.4345 19.4345 19.4345 19.8861 19.8864 19.8864 20.3447 20.9495 20.9495 20.9498 21.7457 21.7457 21.7461 24.0177 24.0177 24.0180 24.0789 24.7973 24.7974 26.8047 26.8050 29.0583 29.0590 29.0590 30.2075 31.2069 31.2073 31.2076 33.4982 33.4983 33.4986 37.2308 37.2310 37.2310 40.7057 40.7059 40.7064 41.3267 42.3889 42.3891 42.3893 44.9004 44.9005 49.6341 49.6349 49.6352 50.2631 50.2632 50.2640 51.3335 51.7291 51.7294 51.9744 51.9757 51.9766 53.1531 54.4530 54.4533 54.4534 54.6310 54.6315 56.4701 56.4704 56.4709 57.0674 57.0682 57.0685 58.6201 59.1563 60.9808 60.9817 60.9820 62.3640 62.3640 62.3643 65.4989 65.4991 65.4995 72.1380 72.1380 72.1392 73.1448 73.1450 75.9731 75.9732 75.9734 76.1502 76.1503 76.1505 76.1790 81.1359 81.1364 81.8872 81.8872 81.8876 85.5866 85.5868 85.5876 86.8764 91.5153 91.5156 100.1512 100.1527 100.1533 100.2595 100.2599 100.2599 105.0562 105.6199 105.6206 105.6210 108.8472 108.8477 108.8478 112.0303 112.0308 112.0316 113.4741 115.9277 115.9281 116.9658 116.9664 116.9664 117.1857 117.1865 128.3762 128.3767 128.3785 134.0169 134.0169 134.0194 140.0657 165.8551 165.8563 167.4167 167.4174 167.4182 169.5800 169.5802 169.5804 176.5807 183.0011 185.0045 185.0047 185.0054 186.8720 186.8724 186.8724 187.5830 187.5877 187.5882 189.9980 189.9986 190.0008 195.9416 195.9419 195.9423 200.5056 204.5174 206.3886 206.3891 206.3906 211.4262 211.4266 213.5989 213.6013 213.6052 214.0835 214.0855 214.0860 219.5924 219.5930 230.8480 230.8481 230.8482 231.3737 232.8874 232.8914 235.0214 235.0216 235.0233 247.5612 247.5620 247.5630 250.0589 250.0592 250.0596 252.3392 252.3398 252.3403 256.4067 256.4085 256.4091 261.0877 261.0893 264.2697 270.6772 270.6794 273.2781 273.2789 273.2795 278.9099 278.9102 278.9107 279.7984 279.7985 287.8528 287.8541 287.8559 297.0323 298.1977 298.1980 298.2000 312.7384 312.7400 312.7418 358.2460 358.2497 358.2512 375.8453 806.1535 electronvolt
e0: -40.216200647 hartree
ecorr: -0.258997957 hartree
chargesum: -0.0000000
charge: -0.981005 0.245237 0.245246 0.245255 0.245266
charge: 1.279657 -0.319925 -0.319893 -0.319915 -0.319924
qa: -0.9810 0.2452 0.2452 0.2453 0.2453
va: 3.8635 0.9790 0.9790 0.9790 0.9790
energy: -40.482497601483 hartree
dipole: 0.00009 -0.00007 0.00002 0.00004 -0.00004 0.00000 0.00002 -0.00002 -0.00000
magnitude: 0.00002 au
magnitude: 0.00005 debye
dipolemethod: MDCI
