program: Orca
programVersion: 5.0.4
elementType: C H H H H
charge: 0
multiplicity: 1
keywords: Opt RIJCOSX NoFrozenCore MP2 cc-pVtz cc-pVtz/C
formula: CH4
InChI: InChI=1/CH4/h1H4
5 atoms
C  -4.520209 2.792112 -0.00759
H  -3.486279 3.057248 -0.187352
H  -5.033237 3.629045 0.448321
H  -4.563501 1.93777 0.655598
H  -4.997585 2.544364 -0.946828
totalener: -40.21330808 hartree
nucrepener: 13.40833246 hartree
electener: -53.62164054 hartree
oneelecener: -79.67980771 hartree
twoeener: 26.05816717 hartree
kineticenergy: 40.13649360 hartree
total: -40.428101411 hartree
energy: -304.8596 -25.7339 -14.8725 -14.8718 -14.8711 3.9208 6.2600 6.2603 6.2605 9.9024 9.9033 9.9036 17.5399 17.7020 17.7025 17.7029 18.6673 18.6687 20.6662 29.3725 29.3736 29.3736 31.5170 31.5190 31.5191 35.9463 35.9483 35.9494 41.8354 41.8361 41.8379 43.5888 43.5912 49.4695 65.8677 65.8699 65.8702 69.7292 81.4537 81.4558 81.4577 85.2964 85.3006 85.5734 85.5742 85.5757 90.0920 90.0946 90.0962 98.6020 98.6026 98.6038 102.0141 102.0209 102.0224 103.5286 103.5298 106.0581 111.5697 111.5726 111.5729 112.3308 112.3317 119.7074 119.7101 119.7105 123.9559 123.9575 123.9583 132.2375 138.2322 138.2345 138.2375 149.6364 149.6381 149.6396 150.3986 150.4035 150.4123 152.2434 154.3204 154.3247 169.4543 169.4563 169.4572 397.6852 electronvolt
chargesum: 0.0000000
charge: -0.494192 0.124301 0.122714 0.124554 0.122622
charge: 0.123100 -0.030759 -0.030795 -0.030733 -0.030813
qa: -0.4942 0.1243 0.1227 0.1246 0.1226
va: 3.9965 0.9873 0.9878 0.9872 0.9878
energy: -40.428102410793 hartree
dipole: 0.00016 -0.00007 0.00010 -0.00002 0.00014 0.00012 0.00007 -0.00016 -0.00009
magnitude: 0.00018 au
magnitude: 0.00046 debye
dipolemethod: MP2 RELAXED
