program: Orca
programVersion: 5.0.4
elementType: C H H H H
charge: 0
multiplicity: 1
keywords: SP CCSD(T) aug-cc-pVQZ def2-TZVP/C def2/J TightSCF
keywords: NoFrozenCore
formula: CH4
InChI: InChI=1/CH4/h1H4
5 atoms
C  -0.000013 0.0000 -0.000003
H  1.033251 0.264952 -0.179643
H  -0.512736 0.836463 0.455644
H  -0.043248 -0.853807 0.662763
H  -0.477112 -0.247611 -0.93873
totalener: -40.21634618 hartree
nucrepener: 13.53814431 hartree
electener: -53.75449049 hartree
oneelecener: -79.93221915 hartree
twoeener: 26.17772865 hartree
kineticenergy: 40.21157906 hartree
energy: -304.8274 -25.7341 -14.8803 -14.8797 -14.8794 0.7471 1.2280 1.2280 1.2280 2.8938 2.8939 2.8940 3.3595 5.0379 5.0379 5.0380 5.6389 5.6389 7.3084 7.3896 7.3897 7.3898 7.6352 7.6352 7.6353 7.9526 7.9527 7.9528 9.0619 10.6790 10.6793 10.7015 10.7015 10.7016 14.9133 14.9133 14.9136 15.0527 15.0529 16.5865 18.6017 18.6020 18.6021 19.4608 19.4608 19.4609 19.8940 19.8943 19.8943 20.3737 20.9853 20.9854 20.9856 21.7393 21.7394 21.7398 24.0466 24.0468 24.0472 24.0725 24.8193 24.8194 26.8829 26.8833 29.0633 29.0640 29.0642 30.2921 31.2301 31.2306 31.2312 33.5279 33.5280 33.5283 37.2654 37.2656 37.2656 40.8294 40.8297 40.8303 41.3964 42.4432 42.4435 42.4439 44.8952 44.8953 49.7243 49.7254 49.7258 50.2769 50.2772 50.2780 51.3548 51.7298 51.7302 52.0225 52.0248 52.0259 53.2475 54.3863 54.3868 54.3870 54.8324 54.8329 56.2699 56.2704 56.2710 57.1834 57.1848 57.1850 58.7645 59.1570 61.0217 61.0231 61.0240 62.3967 62.3968 62.3972 65.6990 65.6991 65.6997 72.2101 72.2106 72.2122 73.4850 73.4852 76.1891 76.1892 76.1897 76.2477 76.2478 76.2480 76.4014 81.0105 81.0110 81.9757 81.9758 81.9762 85.9808 85.9810 85.9816 87.0376 91.7199 91.7202 100.4431 100.4435 100.4437 100.5956 100.5979 100.5982 105.3344 105.8358 105.8368 105.8373 109.2627 109.2634 109.2636 112.0714 112.0725 112.0736 113.7127 115.9702 115.9706 117.1461 117.1470 117.1471 117.2970 117.2979 128.8973 128.8979 128.9003 134.1592 134.1599 134.1634 140.4766 166.3275 166.3288 166.6852 166.6863 166.6875 169.3617 169.3619 169.3622 176.6997 183.1077 185.3649 185.3652 185.3654 187.1621 187.1625 187.1628 188.2072 188.2151 188.2176 190.6737 190.6743 190.6760 196.2209 196.2215 196.2218 200.6169 204.9191 206.4886 206.4906 206.4929 211.4249 211.4252 214.3261 214.3317 214.3370 214.8944 214.8972 214.8995 220.4514 220.4522 231.2129 231.2131 231.2133 232.9088 232.9581 232.9628 235.4339 235.4344 235.4361 248.0277 248.0292 248.0311 250.4058 250.4067 250.4072 253.0080 253.0090 253.0094 257.0732 257.0756 257.0766 260.9555 260.9577 264.8064 271.9185 271.9209 273.8988 273.9005 273.9008 279.2976 279.2984 279.2992 281.0413 281.0413 289.1765 289.1784 289.1812 298.4497 298.9054 298.9056 298.9088 314.0419 314.0429 314.0452 360.2237 360.2279 360.2316 376.4657 810.4042 electronvolt
e0: -40.216346181 hartree
ecorr: -0.258880771 hartree
chargesum: 0.0000000
charge: -0.986336 0.246567 0.246587 0.246584 0.246597
charge: 1.292040 -0.323038 -0.322984 -0.323022 -0.322996
qa: -0.9863 0.2466 0.2466 0.2466 0.2466
va: 3.8608 0.9783 0.9783 0.9783 0.9783
energy: -40.482473225385 hartree
dipole: 0.00014 -0.00011 0.00003 -0.00000 -0.00000 -0.00001 0.00003 -0.00003 0.00001
magnitude: 0.00004 au
magnitude: 0.00009 debye
dipolemethod: MDCI
