program: Orca
programVersion: 5.0.4
elementType: C H H H H
charge: 0
multiplicity: 1
keywords: Opt RIJCOSX NoFrozenCore MP2 def2-SVP def2-SVP/C
formula: CH4
InChI: InChI=1/CH4/h1H4
5 atoms
C  -4.520147 2.792107 -0.007559
H  -3.474827 3.060188 -0.189333
H  -5.038938 3.638271 0.453272
H  -4.564007 1.928327 0.662843
H  -5.00289 2.541647 -0.957074
totalener: -40.16928649 hartree
nucrepener: 13.40833246 hartree
electener: -53.57761895 hartree
oneelecener: -79.58655529 hartree
twoeener: 26.00893634 hartree
kineticenergy: 39.85619266 hartree
total: -40.334099059 hartree
energy: -305.2993 -25.3319 -14.8071 -14.8062 -14.8051 5.0703 7.4374 7.4379 7.4381 16.1474 16.1489 16.1499 23.6611 25.1889 25.1903 25.1954 27.4092 36.4372 36.4379 49.1371 49.1385 49.1391 55.5027 55.5046 55.5081 66.3385 66.3396 66.3405 77.5338 77.5356 80.0082 88.8093 88.8129 88.8149 electronvolt
chargesum: -0.0000000
charge: -0.176161 0.044178 0.044092 0.044048 0.043843
charge: -0.104167 0.026054 0.026052 0.026043 0.026018
qa: -0.1762 0.0442 0.0441 0.0440 0.0438
va: 4.0802 0.9953 0.9953 0.9953 0.9953
energy: -40.334100507608 hartree
dipole: -0.00005 -0.00026 -0.00031 0.00001 -0.00012 -0.00012 -0.00004 -0.00010 -0.00014
magnitude: 0.00036 au
magnitude: 0.00092 debye
dipolemethod: MP2 RELAXED
