program: Orca
programVersion: 5.0.4
elementType: C H
charge: 0
multiplicity: 2
keywords: SP CCSD(T) aug-cc-pVQZ def2-TZVP/C def2/J TightSCF
keywords: NoFrozenCore
formula: CH
InChI: InChI=1/CH/h1H
2 atoms
C  0.086891 0.0000 0.0000
H  -1.0354 0.0000 0.0000
totalener: -38.28392229 hartree
nucrepener: 2.82909009 hartree
electener: -41.11301237 hartree
oneelecener: -56.59840692 hartree
twoeener: 15.48539455 hartree
kineticenergy: 38.26036510 hartree
s2: 0.759749
energy: -308.2131 -23.9177 -12.8755 -11.5800 0.5010 0.7150 2.1979 2.2646 2.8260 3.4659 5.2750 5.9371 5.9668 6.3529 6.3584 7.7262 7.8643 8.0075 9.2491 11.6100 12.1582 13.1543 14.9845 17.1072 17.1907 17.9949 17.9950 20.1829 20.5727 20.5732 21.0385 21.2351 21.2749 22.6666 22.7040 24.2709 25.0450 25.0574 25.0767 25.1841 29.5136 34.3486 34.7296 39.1512 45.1698 45.1711 45.7957 46.0060 46.4389 52.0784 52.6326 52.6518 53.4709 53.4949 57.6393 57.6665 57.6681 58.0272 58.0358 59.3240 59.4198 61.4073 61.4160 61.7500 61.7503 62.4709 64.6888 65.0469 65.5860 65.5948 65.6039 65.8263 66.0734 72.2585 72.4524 79.3719 87.4653 94.5300 94.8597 96.1580 96.1670 108.9040 112.2073 112.4859 112.6584 159.3130 159.3474 159.5772 159.7912 160.6559 160.6592 161.2996 161.3002 162.5320 168.7418 169.0919 169.9807 170.4944 173.5720 173.5791 176.0869 176.0876 176.3785 178.9029 178.9580 182.4776 184.3473 184.3473 196.7521 198.5939 198.9862 208.3648 208.3664 224.0377 224.2667 226.0646 242.8598 242.8619 248.3264 253.8702 254.1246 270.5776 270.9785 281.4737 328.9641 627.5556 electronvolt
energy: -307.5823 -21.3517 -11.8425 0.7429 0.8043 1.4667 2.2886 3.0487 3.5865 3.8991 5.3444 5.9752 6.2208 6.5166 6.5324 7.7654 8.0461 8.2682 9.4957 11.7686 13.4047 14.3016 15.2699 17.1918 17.5599 18.2732 18.2859 20.4902 20.8006 20.8018 21.1832 21.8892 22.0108 22.7149 23.2285 24.3497 25.0943 25.3943 25.4332 25.5305 29.7868 34.8415 35.4979 39.3893 45.2904 45.2931 46.1470 46.5240 46.9119 52.2271 52.7663 52.7861 53.6208 54.5510 58.0408 58.0418 58.1094 58.6987 58.7168 59.5692 60.4338 62.2865 62.4602 62.4671 62.5508 63.1361 64.7177 65.4367 65.6581 65.8985 65.9100 66.1959 66.6676 72.3050 72.9874 79.7859 87.6849 94.5375 95.0754 96.3862 96.4103 109.0542 112.3104 112.9227 113.1368 159.6442 159.7323 159.7805 160.8917 161.1363 161.3494 162.0267 162.0310 162.8867 168.8945 169.9015 170.1073 171.2963 174.5898 174.6289 176.7729 177.1709 177.1794 179.7244 179.9390 182.7630 184.4764 184.4766 196.8816 198.7736 199.9029 208.5459 208.5527 224.0105 224.3563 226.1113 242.8708 242.8739 248.4189 253.8477 254.1973 270.6181 271.2635 281.5256 329.0285 627.9639 electronvolt
e0: -38.283922392 hartree
ecorr: -0.158411551 hartree
corrType: UHF
chargesum: -0.0000000
charge: -0.278291 0.278291
charge: 0.704855 -0.704855
qa: -0.2783 0.2783
va: 2.1680 0.8469
energy: -38.446435305063 hartree
dipole: -0.97139 0.41134 -0.56005 0.00000 -0.00000 -0.00000 0.00000 -0.00000 -0.00000
magnitude: 0.56005 au
magnitude: 1.42353 debye
dipolemethod: MDCI
