program: Orca
programVersion: 5.0.4
elementType: C
charge: 0
multiplicity: 3
keywords: RIJCOSX NoFrozenCore MP2 def2-SVP def2-SVP/C
formula: C
InChI: InChI=1/C
1 atoms
C  -4.69274 2.56432 -0.17557
totalener: -37.64523597 hartree
nucrepener: 0.00000000 hartree
electener: -37.64523597 hartree
oneelecener: -50.38651954 hartree
twoeener: 12.74128358 hartree
kineticenergy: 37.64842711 hartree
s2: 2.006584
energy: -308.6873 -22.1581 -11.9848 -11.9848 1.0561 13.3632 17.2693 17.2693 19.5340 51.4013 51.4013 52.2691 52.2691 52.6023 electronvolt
energy: -307.3581 -15.4975 2.2064 3.7414 3.7414 15.1425 20.4098 21.8369 21.8369 54.7162 55.1612 55.1612 56.6233 56.6233 electronvolt
chargesum: 0.0000000
charge: 0.000000
total: -37.696885216 hartree
energy: -37.696885215941 hartree
dipole: 0.00000 0.00000 0.00000 0.00000 0.00001 0.00001 0.00000 -0.00000 -0.00000
magnitude: 0.00001 au
magnitude: 0.00003 debye
