program: Orca
programVersion: 5.0.4
elementType: C
charge: 0
multiplicity: 3
keywords: RIJCOSX CCSD(T) NUMGRAD def2-TZVP def2-TZVP/C
formula: C
InChI: InChI=1/C
1 atoms
C  -4.69274 2.56432 -0.17557
totalener: -37.69248112 hartree
nucrepener: 0.00000000 hartree
electener: -37.69248112 hartree
oneelecener: -50.45048381 hartree
twoeener: 12.75800270 hartree
kineticenergy: 37.69475904 hartree
s2: 2.009980
energy: -308.7230 -22.5530 -11.9414 -11.9414 0.8202 6.5499 8.8488 8.8488 10.4057 22.3042 22.3042 22.8123 22.8123 23.0182 38.9737 44.6868 44.6868 45.9860 79.8130 79.8649 79.8649 80.0191 80.0191 80.2702 80.2702 87.8771 87.8771 88.1212 88.1212 88.2120 605.7231 electronvolt
energy: -307.4760 -15.8669 1.6666 2.9971 2.9971 7.4016 11.0698 12.2803 12.2803 24.1764 24.4724 24.4724 25.4418 25.4418 40.8301 46.7067 48.1668 48.1668 80.9116 81.1098 81.1098 81.7106 81.7106 82.7366 82.7366 89.8523 90.2925 90.2925 91.7155 91.7155 606.5727 electronvolt
e0: -37.692481640 hartree
ecorr: -0.086520853 hartree
corrType: UHF
chargesum: -0.0000000
charge: -0.000000
energy: -37.781033106295 hartree
dipole: 0.00000 -0.00000 -0.00000 0.00000 -0.00000 -0.00000 0.00000 -0.00000 -0.00000
magnitude: 0.00000 au
magnitude: 0.00000 debye
dipolemethod: MDCI
