program: Orca
programVersion: 5.0.4
elementType: C
charge: -1
multiplicity: 4
keywords: SP CCSD(T) aug-cc-pVQZ aug-cc-pVQZ/C TightSCF
keywords: NoFrozenCore
formula: C
InChI: InChI=1/C
1 atoms
C  0.0000 0.0000 0.0000
totalener: -37.70995053 hartree
nucrepener: 0.00000000 hartree
electener: -37.70995053 hartree
oneelecener: -52.54524853 hartree
twoeener: 14.83529800 hartree
kineticenergy: 37.70891695 hartree
s2: 3.756907
energy: -298.6535 -14.3004 -2.1233 -2.1233 -2.1233 6.5259 6.5259 6.5259 7.0144 11.6544 11.6544 11.6544 11.6544 11.6544 18.3936 18.3936 18.3936 20.3066 27.4339 27.4339 27.4339 27.4339 27.4339 27.4339 27.4339 28.1766 28.1766 28.1766 28.1766 28.1766 51.4993 51.4993 51.4993 66.0228 66.0758 66.0758 66.0758 66.0758 66.0758 66.0758 66.0758 66.0758 66.0758 68.6295 68.6295 68.6295 68.6295 68.6295 70.5248 70.5248 70.5248 70.5248 70.5248 70.5248 70.5248 167.1798 167.1798 167.1798 171.1008 171.1008 171.1008 171.1008 171.1008 171.1008 171.1008 171.1008 171.1008 182.8383 182.8383 182.8383 182.8383 182.8383 185.8013 185.8013 185.8013 185.8013 185.8013 185.8013 185.8013 566.2881 electronvolt
energy: -297.3338 -5.7933 6.1636 6.1636 6.1636 7.6046 11.8000 11.8000 11.8000 12.2060 12.2060 12.2060 12.2060 12.2060 21.8903 21.8903 21.8903 22.0469 28.0748 28.0748 28.0748 28.0748 28.0748 28.0748 28.0748 30.4295 30.4295 30.4295 30.4295 30.4295 54.2977 54.2977 54.2977 66.8423 66.8423 66.8423 66.8423 66.8423 66.8423 66.8423 66.8423 66.8423 68.2108 71.5770 71.5770 71.5770 71.5770 71.5770 72.0533 72.0533 72.0533 72.0533 72.0533 72.0533 72.0533 168.9709 168.9709 168.9709 172.3145 172.3145 172.3145 172.3145 172.3145 172.3145 172.3145 172.3145 172.3145 184.9439 184.9439 184.9439 184.9439 184.9439 187.5700 187.5700 187.5700 187.5700 187.5700 187.5700 187.5700 567.2331 electronvolt
e0: -37.709950338 hartree
ecorr: -0.142881339 hartree
corrType: UHF
chargesum: -1.0000000
charge: -1.000000
energy: -37.858267676674 hartree
dipole: 0.00000 0.00000 0.00000 0.00000 0.00000 0.00000 0.00000 0.00000 0.00000
magnitude: 0.00000 au
magnitude: 0.00000 debye
dipolemethod: MDCI
