program: Orca
programVersion: 5.0.4
elementType: C
charge: 1
multiplicity: 4
keywords: SP CCSD(T) aug-cc-pVQZ aug-cc-pVQZ/C TightSCF
keywords: NoFrozenCore
formula: C
InChI: InChI=1/C
1 atoms
C  0.0000 0.0000 0.0000
totalener: -37.16267237 hartree
nucrepener: 0.00000000 hartree
electener: -37.16267237 hartree
oneelecener: -47.37919072 hartree
twoeener: 10.21651835 hartree
kineticenergy: 37.16335737 hartree
s2: 3.750010
energy: -324.0640 -36.5908 -25.8830 -25.8830 -10.8976 -3.4098 -2.3743 -2.3743 -2.2199 0.4336 0.4490 0.4490 0.5173 0.5173 3.8013 3.8013 4.4500 5.3740 11.6356 11.6356 11.8210 11.8210 11.9130 12.9083 12.9460 12.9460 13.0610 13.0610 13.2569 13.2569 30.9379 30.9379 31.9284 44.9006 47.2577 47.2577 47.5013 47.5013 47.6366 47.8165 47.8504 47.8504 47.9834 47.9834 48.2144 48.2144 48.5435 48.5435 50.6607 50.7281 50.7281 50.9318 50.9318 51.2739 51.2739 143.6219 143.6219 143.7999 148.3007 148.3849 148.3849 148.6379 148.6379 149.0605 149.0605 149.6538 149.6538 158.9652 159.0541 159.0541 159.3346 159.3346 162.0111 162.1231 162.1231 162.4608 162.4608 163.0289 163.0289 541.5141 electronvolt
energy: -320.8214 -13.3774 -6.7237 -5.3395 -5.3395 -2.7168 -1.8353 -1.4770 -1.4770 0.6133 0.6728 0.6728 0.8666 0.8666 5.4782 6.3496 6.3496 7.3341 13.1076 13.1609 13.1609 13.2017 13.3224 13.3224 13.4038 13.4038 13.5994 13.5994 14.0801 14.0801 33.4588 34.9988 34.9988 48.2010 48.2648 48.2648 48.4550 48.4550 48.7724 48.7724 48.7843 49.2213 49.2213 50.3995 50.8016 50.8016 51.8928 52.0453 52.0453 52.1430 52.1430 52.5083 52.5083 53.3069 53.3069 145.0710 146.8048 146.8048 149.5854 149.7160 149.7160 150.1093 150.1093 150.7699 150.7699 151.7064 151.7064 161.1992 161.7122 161.7122 163.3122 163.3122 164.0649 164.3154 164.3154 165.0729 165.0729 166.3746 166.3746 544.2222 electronvolt
e0: -37.162672448 hartree
ecorr: -0.042559100 hartree
corrType: UHF
chargesum: 1.0000000
charge: 1.000000
energy: -37.205356343093 hartree
dipole: 0.00000 0.00000 0.00000 0.00000 0.00000 0.00000 0.00000 0.00000 0.00000
magnitude: 0.00000 au
magnitude: 0.00000 debye
dipolemethod: MDCI
