program: Orca
programVersion: 5.0.4
elementType: C
charge: -2
multiplicity: 1
keywords: RIJCOSX PBEh-3c
formula: C
InChI: InChI=1/C
1 atoms
C  -4.69274 2.56432 -0.17557
totalener: -37.29541085 hartree
nucrepener: 0.00000000 hartree
electener: -37.29541085 hartree
oneelecener: -54.91157892 hartree
twoeener: 17.61616808 hartree
kineticenergy: 37.66269728 hartree
exchangeener: -3.057618275295 hartree
correlationener: -0.307149694753 hartree
xcener: -3.364767970048 hartree
energy: -265.4979 4.1565 13.0050 13.0050 16.3062 33.2216 33.3479 33.3479 37.0165 68.5383 68.7132 68.7132 69.5963 69.5963 379.3875 electronvolt
chargesum: -2.0000000
charge: -2.000000
dispersion: 0.000000000 hartree
energy: -37.295410845674 hartree
dipole: 0.00000 -0.00000 -0.00000 0.00000 -0.00000 -0.00000 0.00000 -0.00001 -0.00001
magnitude: 0.00001 au
magnitude: 0.00003 debye
