program: Orca
programVersion: 5.0.4
elementType: C
charge: -3
multiplicity: 2
keywords: SP CCSD(T) aug-cc-pVQZ aug-cc-pVQZ/C TightSCF
keywords: NoFrozenCore
formula: C
InChI: InChI=1/C
1 atoms
C  0.0000 0.0000 0.0000
totalener: -37.14157141 hartree
nucrepener: 0.00000000 hartree
electener: -37.14157141 hartree
oneelecener: -54.16288809 hartree
twoeener: 17.02131668 hartree
kineticenergy: 37.80372501 hartree
s2: 2.466626
energy: -290.8567 -6.2015 5.9703 5.9703 6.2366 13.4238 13.8519 13.8519 14.7203 19.4488 19.5467 19.5467 19.9550 19.9550 26.2828 26.4688 26.4688 28.3547 35.5390 35.5785 35.5785 35.6981 35.6981 35.9029 35.9029 36.2544 36.3041 36.3041 36.4654 36.4654 59.4971 59.5382 59.5382 74.0128 74.1855 74.1997 74.1997 74.2422 74.2422 74.3131 74.3131 74.4124 74.4124 76.6439 76.6599 76.6599 76.7148 76.7148 78.5829 78.6020 78.6020 78.6595 78.6595 78.7563 78.7563 175.0718 175.0992 175.0992 179.0676 179.0771 179.0771 179.1055 179.1055 179.1529 179.1529 179.2194 179.2194 190.7390 190.7536 190.7536 190.7979 190.7979 193.7170 193.7291 193.7291 193.7655 193.7655 193.8262 193.8262 574.1161 electronvolt
energy: -289.4847 2.2920 9.2869 9.2869 12.5014 13.6704 19.2997 19.2997 19.4406 19.4406 19.5064 19.5655 19.5997 19.5997 29.6720 29.8536 29.8536 29.9495 36.0751 36.0999 36.0999 36.1753 36.1753 36.3036 36.3036 38.3660 38.4055 38.4055 38.5279 38.5279 62.1523 62.3278 62.3278 74.9153 74.9280 74.9280 74.9663 74.9663 75.0303 75.0303 75.1205 75.1205 76.2025 79.4989 79.5409 79.5409 79.6687 79.6687 80.0505 80.0710 80.0710 80.1327 80.1327 80.2362 80.2362 176.7809 176.9130 176.9130 180.2538 180.2656 180.2656 180.3009 180.3009 180.3599 180.3599 180.4425 180.4425 192.7891 192.8283 192.8283 192.9463 192.9463 195.4498 195.4698 195.4698 195.5297 195.5297 195.6300 195.6300 575.1084 electronvolt
e0: -37.141571410 hartree
ecorr: -0.170505498 hartree
corrType: UHF
chargesum: -3.0000000
charge: -3.000000
energy: -37.325548961750 hartree
dipole: 0.00000 -0.00000 -0.00000 0.00000 -0.00000 -0.00000 0.00000 0.00000 0.00000
magnitude: 0.00000 au
magnitude: 0.00000 debye
dipolemethod: MDCI
