program: Orca
programVersion: 5.0.4
elementType: C
charge: -4
multiplicity: 1
keywords: RIJCOSX PBEh-3c
formula: C
InChI: InChI=1/C
1 atoms
C  -4.69274 2.56432 -0.17557
totalener: -35.58223063 hartree
nucrepener: 0.00000000 hartree
electener: -35.58223063 hartree
oneelecener: -58.70699733 hartree
twoeener: 23.12476669 hartree
kineticenergy: 37.73334597 hartree
exchangeener: -3.332747438694 hartree
correlationener: -0.396559622498 hartree
xcener: -3.729307061192 hartree
energy: -247.2753 22.5498 30.3949 30.3949 30.3949 51.0099 51.0099 51.0099 54.8046 88.6050 88.6050 88.6050 88.6050 88.6050 397.9954 electronvolt
chargesum: -4.0000000
charge: -4.000000
dispersion: 0.000000000 hartree
energy: -35.582230634493 hartree
dipole: 0.00000 0.00000 0.00000 0.00000 0.00000 0.00000 0.00000 0.00001 0.00001
magnitude: 0.00001 au
magnitude: 0.00001 debye
