program: Orca
programVersion: 5.0.4
elementType: C H H
charge: 0
multiplicity: 1
keywords: Opt RIJCOSX PBEh-3c
formula: CH2
InChI: InChI=1/CH2/h1H2
3 atoms
C  -6.630459 2.566962 0.191037
H  -5.580245 2.661085 -0.14463
H  -7.194855 2.823943 -0.725428
totalener: -39.00681637 hartree
nucrepener: 6.17793459 hartree
electener: -45.18475096 hartree
oneelecener: -63.89608282 hartree
twoeener: 18.71133186 hartree
kineticenergy: 38.77595258 hartree
exchangeener: -3.217167806494 hartree
correlationener: -0.309618132726 hartree
xcener: -3.526785939220 hartree
dispersion: -0.000282707 hartree
dispersion: -0.000283256 hartree
dispersion: -0.000284113 hartree
dispersion: -0.000284663 hartree
dispersion: -0.000284510 hartree
dispersion: -0.000284520 hartree
energy: -285.8867 -20.3314 -12.6646 -8.0330 -2.3874 4.6563 5.7027 13.8329 14.8592 15.1357 21.6857 26.8264 27.8234 46.7677 47.1343 47.3705 55.5511 62.5569 365.0854 electronvolt
chargesum: 0.0000000
charge: -0.367345 0.183686 0.183659
charge: -0.205441 0.102726 0.102715
qa: -0.3673 0.1837 0.1837
va: 1.8365 0.9139 0.9139
energy: -39.031614035903 hartree
dipole: 0.39028 -0.10363 0.28665 0.28205 -0.07475 0.20730 -1.00589 0.26735 -0.73854
magnitude: 0.81889 au
magnitude: 2.08145 debye
