program: Orca
programVersion: 5.0.4
elementType: C H H
charge: 1
multiplicity: 2
keywords: SP CCSD(T) aug-cc-pVQZ aug-cc-pVQZ/C TightSCF
keywords: NoFrozenCore
formula: CH2
InChI: InChI=1/CH2/h1H2
3 atoms
C  -0.018816 -0.013588 0.048459
H  1.071158 -0.015819 0.056413
H  -0.846945 0.177734 -0.63385
totalener: -38.58388718 hartree
nucrepener: 6.08440287 hartree
electener: -44.66829006 hartree
oneelecener: -60.53533848 hartree
twoeener: 15.86704843 hartree
kineticenergy: 38.56070422 hartree
s2: 0.755881
energy: -319.4713 -35.2811 -27.5270 -23.0738 -8.4513 -3.6428 -2.5893 -2.2233 -1.9557 -1.4550 -0.7091 -0.6683 -0.2765 0.1675 0.5890 0.6106 2.0612 2.4924 2.5848 3.2360 3.4311 3.5968 3.7172 4.2776 5.4999 6.3415 6.9068 8.7839 9.2540 10.7313 10.7786 11.6002 12.6802 12.7297 12.7460 13.2679 13.6675 13.7225 14.0323 14.1531 15.0477 15.2788 16.6794 17.4461 17.4759 18.7454 19.2215 20.8508 21.9060 22.2876 23.2539 23.8820 25.4735 30.3735 30.7954 32.4117 32.7733 33.3851 36.8242 38.3454 38.6622 38.7395 39.1612 39.7057 39.8838 40.8484 43.8714 44.8128 45.5024 45.5969 45.6389 47.9235 48.2714 48.6284 48.7583 49.1143 50.1088 51.4538 51.8375 52.2195 52.3715 52.9912 53.5225 53.9096 55.0366 56.8468 57.2027 59.1917 59.2007 60.1312 61.0479 62.1648 64.7837 66.4269 67.6738 69.5259 73.2603 80.5742 82.3682 84.5849 86.6785 87.7181 87.7516 89.4976 94.6251 94.9899 96.3905 99.1006 104.8426 104.8777 105.4136 106.3213 108.4824 116.4769 121.4932 148.2157 149.9750 150.2174 150.7019 150.7036 151.7859 152.4290 153.2082 155.4476 155.7505 162.3129 162.3245 162.4416 162.6599 163.8975 164.0495 167.8213 169.5779 174.4671 175.4730 176.1919 176.3333 179.4593 180.5799 185.3817 190.7047 195.7452 196.9596 198.1881 201.6577 208.2186 212.3883 213.5490 215.4357 218.2379 218.4433 222.5344 224.3431 234.1586 236.9162 237.8475 241.7702 242.2062 242.9015 247.6542 252.9850 253.8720 261.5778 271.2701 271.7492 273.5137 274.5739 288.9944 302.2941 316.5741 350.7858 682.7095 electronvolt
energy: -318.6602 -32.7196 -26.9887 -7.6388 -6.6807 -3.5213 -2.5495 -1.8689 -1.7456 -1.2476 -0.6455 -0.5941 -0.0510 0.1716 0.7716 0.7777 2.5591 2.6082 2.6611 3.4317 3.4815 3.7314 3.8943 4.5859 5.7702 6.5413 7.3306 9.2766 9.6200 11.2603 11.2625 11.7095 12.8167 12.8226 12.9235 13.5770 13.9123 13.9819 14.1335 14.1981 15.3827 15.5219 16.8098 17.7306 17.8442 18.8190 19.2680 21.2986 22.0814 22.4031 23.9166 24.1712 25.6757 30.7532 30.8247 32.7065 33.0600 33.7254 36.8787 38.6296 38.8504 39.0968 39.2387 39.7732 39.9230 41.4597 44.0626 45.0779 45.6444 45.6798 45.8236 48.0486 48.5469 48.8909 49.8168 49.8617 50.5356 51.5833 52.4231 52.6797 53.1934 53.6063 54.2523 54.5566 55.1677 57.3898 57.4273 59.5341 59.5476 60.3103 61.3353 62.3234 64.9613 66.8506 67.8135 70.0499 73.6577 80.8885 82.4331 84.6868 86.9253 87.8541 87.9641 89.5382 94.7177 95.3352 96.5284 99.3703 105.0094 105.1154 105.9736 106.6895 108.7064 116.8086 121.7122 148.5729 150.3428 150.5424 151.3813 151.4083 152.2301 152.9447 154.3509 155.7420 156.1277 162.9341 162.9419 163.0451 163.4733 164.9766 165.0737 168.2599 170.0069 174.8569 175.8055 176.4217 176.5468 179.7910 180.9680 185.9093 191.8063 196.0316 197.2901 198.5044 201.8254 208.3519 212.4392 213.6471 215.5210 218.3669 218.4583 222.6907 224.4263 234.1947 237.0638 237.9120 241.8603 242.2096 242.9189 247.7627 253.0125 253.9279 261.7400 271.3326 271.9872 273.6487 274.7433 289.1327 302.5084 316.7542 350.8799 683.1586 electronvolt
e0: -38.583887303 hartree
ecorr: -0.148501359 hartree
corrType: UHF
chargesum: 1.0000000
charge: -0.231502 0.615737 0.615765
charge: 1.549571 -0.274743 -0.274829
qa: -0.2315 0.6157 0.6158
va: 2.2982 0.6274 0.6274
energy: -38.735025911385 hartree
dipole: 0.21035 -0.11304 0.09731 0.15190 -0.08165 0.07026 -0.54173 0.29115 -0.25058
magnitude: 0.27784 au
magnitude: 0.70623 debye
dipolemethod: MDCI
