program: Orca
programVersion: 5.0.4
elementType: C H H
charge: -2
multiplicity: 1
keywords: Opt RIJCOSX PBEh-3c
formula: CH2
InChI: InChI=1/CH2/h1H2
3 atoms
C  -6.654664 2.549364 0.253798
H  -5.551478 2.668196 -0.169991
H  -7.199418 2.83443 -0.762827
totalener: -38.63366810 hartree
nucrepener: 6.17793459 hartree
electener: -44.81160269 hartree
oneelecener: -69.45174624 hartree
twoeener: 24.64014355 hartree
kineticenergy: 38.93020739 hartree
exchangeener: -3.485699347622 hartree
correlationener: -0.397206095098 hartree
xcener: -3.882905442720 hartree
dispersion: -0.000282707 hartree
dispersion: -0.000283106 hartree
dispersion: -0.000284097 hartree
dispersion: -0.000285469 hartree
dispersion: -0.000285534 hartree
dispersion: -0.000285706 hartree
dispersion: -0.000285725 hartree
energy: -265.8016 -0.8772 6.1610 9.9469 12.0649 19.3043 20.5787 31.0685 32.3739 32.6650 40.3644 42.2770 43.6276 66.8754 67.5899 67.9085 74.2074 78.8688 384.5432 electronvolt
chargesum: -2.0000000
charge: -1.505220 -0.247251 -0.247529
charge: -1.752068 -0.123876 -0.124056
qa: -1.5052 -0.2473 -0.2475
va: 1.7937 0.8815 0.8814
dispersion: -0.000285727 hartree
energy: -38.670738456181 hartree
dipole: 0.44861 -0.29752 0.15109 0.32447 -0.21566 0.10880 -1.15714 0.76907 -0.38808
magnitude: 0.43043 au
magnitude: 1.09407 debye
