program: Orca
programVersion: 5.0.4
elementType: C H H
charge: 2
multiplicity: 1
keywords: Opt RIJCOSX PBEh-3c
formula: CH2
InChI: InChI=1/CH2/h1H2
3 atoms
C  -6.468524 2.683976 -0.226341
H  -5.376779 2.574828 0.16391
H  -7.560257 2.793186 -0.616589
totalener: -37.83947919 hartree
nucrepener: 6.17793459 hartree
electener: -44.01741378 hartree
oneelecener: -56.93235144 hartree
twoeener: 12.91493766 hartree
kineticenergy: 37.92347095 hartree
exchangeener: -2.864409407134 hartree
correlationener: -0.226971559331 hartree
xcener: -3.091380966465 hartree
dispersion: -0.000282707 hartree
dispersion: -0.000281154 hartree
dispersion: -0.000280193 hartree
dispersion: -0.000280025 hartree
dispersion: -0.000280052 hartree
dispersion: -0.000280075 hartree
dispersion: -0.000280716 hartree
dispersion: -0.000280062 hartree
dispersion: -0.000280650 hartree
dispersion: -0.000280065 hartree
dispersion: -0.000280596 hartree
dispersion: -0.000280094 hartree
dispersion: -0.000280095 hartree
energy: -313.3731 -41.3382 -35.7897 -23.9574 -23.9572 -15.6767 -10.3904 -3.7585 -3.7572 -1.3279 2.6364 6.9727 10.0493 22.9303 22.9317 24.4962 24.4969 41.2101 335.9232 electronvolt
chargesum: 2.0000000
charge: 0.742874 0.628565 0.628561
charge: 1.160221 0.419892 0.419887
qa: 0.7429 0.6286 0.6286
va: 1.1861 0.6072 0.6072
energy: -37.877032478016 hartree
dipole: 0.00001 0.00000 0.00001 0.00005 -0.00003 0.00002 0.00000 0.00000 0.00000
magnitude: 0.00002 au
magnitude: 0.00006 debye
