program: Orca
programVersion: 5.0.4
elementType: C H H H
charge: 1
multiplicity: 1
keywords: Freq RIJCOSX PBEh-3c
frequency: 0.00 0.00 0.00 0.00 0.00 0.00 1440.81 1453.89 1454.18 3147.81 3358.47 3358.63
frequency: 1440.81 1453.89 1454.18 3147.81 3358.47 3358.63
formula: CH3
InChI: InChI=1/CH3/h1H3
4 atoms
C  -5.591819 1.964822 -0.064799
H  -4.567519 2.314852 0.028165
H  -6.103876 1.54786 0.798004
H  -6.103697 2.031676 -1.020791
totalener: -39.38191156 hartree
nucrepener: 9.61071129 hartree
electener: -48.99262284 hartree
oneelecener: -68.00207229 hartree
twoeener: 19.00944945 hartree
kineticenergy: 39.14069323 hartree
exchangeener: -3.277186610753 hartree
correlationener: -0.311457838906 hartree
xcener: -3.588644449659 hartree
energy: -296.5734 -30.6961 -23.0516 -23.0499 -12.0575 -3.3015 -1.9602 -1.9584 4.9528 4.9557 6.2790 11.2817 19.1065 19.4788 19.4814 35.9427 35.9459 46.3435 50.3450 50.3560 355.9459 electronvolt
chargesum: 1.0000000
charge: -0.145333 0.381765 0.381754 0.381814
charge: 0.310195 0.229913 0.229939 0.229954
qa: -0.1453 0.3818 0.3818 0.3818
va: 2.4988 0.8320 0.8320 0.8320
dispersion: -0.000481750 hartree
energy: -39.381511317921 hartree
dipole: 0.00027 -0.00025 0.00002 -0.00006 0.00006 0.00001 -0.00017 0.00001 -0.00016
magnitude: 0.00016 au
magnitude: 0.00040 debye
temp: 298.15 k
press: 1.00 atm
zeropoint: 0.03238142 hartree
thermalvibcorrection: 0.00001818 hartree
thermalrotcorrection: 0.00141627 hartree
thermaltrasncorrection: 0.00141627 hartree
thermaltotal: -39.34627917 hartree
thermalcorr: 0.00285073 hartree
nonthermalcorr: 0.03238142 hartree
totalcorr: 0.03523215 hartree
thermalcorrenthalpy: 0.00094421 hartree
totalenthalpy: -39.34533496 hartree
vibrat: 0.00002079 hartree
rotat: 0.00665780 hartree
transl: 0.01618771 hartree
total: 0.02286629 hartree
totalentropycorr: -0.02286629 hartree
gibbsenthalpy: -39.36820125 hartree
gibbsminuselec: 0.01331007 hartree
