program: Orca
programVersion: 5.0.4
elementType: C H H H H
charge: 0
multiplicity: 1
keywords: SP CCSD(T) aug-cc-pVQZ def2-TZVP/C def2/J TightSCF
keywords: NoFrozenCore
formula: CH4
InChI: InChI=1/CH4/h1H4
5 atoms
C  0.000013 -0.000003 0.000039
H  1.037913 0.266201 -0.180537
H  -0.51515 0.840312 0.457454
H  -0.043518 -0.85777 0.665555
H  -0.479403 -0.248711 -0.942936
totalener: -40.21627728 hartree
nucrepener: 13.47724534 hartree
electener: -53.69352262 hartree
oneelecener: -79.81698237 hartree
twoeener: 26.12345975 hartree
kineticenergy: 40.18322746 hartree
energy: -304.8947 -25.6787 -14.8469 -14.8456 -14.8438 0.7466 1.2287 1.2288 1.2288 2.8929 2.8932 2.8933 3.3575 5.0343 5.0343 5.0344 5.6343 5.6345 7.2989 7.3872 7.3875 7.3878 7.6295 7.6296 7.6296 7.9524 7.9526 7.9528 9.0538 10.6763 10.6766 10.6769 10.6819 10.6826 14.8947 14.8952 14.8953 15.0779 15.0782 16.5388 18.5821 18.5826 18.5827 19.4430 19.4431 19.4434 19.8884 19.8888 19.8894 20.3541 20.9602 20.9611 20.9618 21.7431 21.7441 21.7443 24.0265 24.0266 24.0275 24.0769 24.8045 24.8047 26.8292 26.8302 29.0593 29.0600 29.0616 30.2342 31.2138 31.2151 31.2159 33.5073 33.5082 33.5084 37.2417 37.2418 37.2421 40.7439 40.7458 40.7472 41.3491 42.4058 42.4068 42.4074 44.8988 44.8991 49.6627 49.6641 49.6662 50.2668 50.2686 50.2696 51.3409 51.7302 51.7312 51.9886 51.9915 51.9956 53.1828 54.4302 54.4317 54.4322 54.6926 54.6939 56.4045 56.4071 56.4087 57.1027 57.1043 57.1056 58.6665 59.1562 60.9936 60.9968 60.9979 62.3732 62.3741 62.3744 65.5606 65.5614 65.5635 72.1622 72.1630 72.1668 73.2539 73.2544 76.0395 76.0403 76.0405 76.1805 76.1818 76.1827 76.2505 81.0975 81.0987 81.9162 81.9169 81.9175 85.7097 85.7125 85.7148 86.9282 91.5813 91.5821 100.2926 100.2942 100.2980 100.3187 100.3203 100.3204 105.1465 105.6878 105.6894 105.6915 108.9804 108.9825 108.9831 112.0420 112.0436 112.0465 113.5505 115.9497 115.9508 117.0239 117.0257 117.0264 117.2130 117.2154 128.5407 128.5457 128.5472 134.0603 134.0623 134.0708 140.1969 166.0027 166.0060 167.1806 167.1852 167.1878 169.5069 169.5079 169.5089 176.6184 183.0342 185.1264 185.1282 185.1298 186.9658 186.9671 186.9675 187.7644 187.7797 187.7818 190.2064 190.2157 190.2229 196.0360 196.0377 196.0393 200.5454 204.6416 206.4137 206.4153 206.4183 211.4321 211.4330 213.8244 213.8322 213.8457 214.3393 214.3444 214.3464 219.8641 219.8659 230.9682 230.9686 230.9688 231.8618 232.9091 232.9204 235.1487 235.1524 235.1558 247.7124 247.7153 247.7208 250.1700 250.1706 250.1717 252.5489 252.5516 252.5542 256.6167 256.6201 256.6249 261.0507 261.0557 264.4419 271.0678 271.0739 273.4771 273.4782 273.4809 279.0354 279.0358 279.0364 280.1929 280.1930 288.2769 288.2834 288.2880 297.4823 298.4140 298.4173 298.4227 313.1485 313.1547 313.1676 358.8725 358.8835 358.8956 376.0565 807.5198 electronvolt
e0: -40.216277277 hartree
ecorr: -0.258959066 hartree
chargesum: -0.0000000
charge: -0.982755 0.245703 0.245700 0.245760 0.245592
charge: 1.283635 -0.320918 -0.320890 -0.320977 -0.320850
qa: -0.9828 0.2457 0.2457 0.2458 0.2456
va: 3.8626 0.9788 0.9788 0.9788 0.9787
energy: -40.482518284012 hartree
dipole: -0.00015 0.00014 -0.00001 0.00003 -0.00004 -0.00001 -0.00043 0.00039 -0.00004
magnitude: 0.00005 au
magnitude: 0.00012 debye
dipolemethod: MDCI
