program: Orca
programVersion: 5.0.4
elementType: C H
charge: 0
multiplicity: 4
keywords: Opt RIJCOSX PBEh-3c
formula: CH
InChI: InChI=1/CH/h1H
2 atoms
C  0.068465 0.0000 0.0000
H  -1.015504 0.0000 0.0000
totalener: -38.36497174 hartree
nucrepener: 2.83348254 hartree
electener: -41.19845428 hartree
oneelecener: -56.66215633 hartree
twoeener: 15.46370205 hartree
kineticenergy: 38.10524683 hartree
exchangeener: -3.050092014374 hartree
correlationener: -0.234415696566 hartree
xcener: -3.284507710940 hartree
s2: 3.751533
dispersion: -0.000138920 hartree
s2: 3.751634
dispersion: -0.000138848 hartree
s2: 3.751632
dispersion: -0.000138849 hartree
energy: -286.2176 -20.5716 -12.2366 -8.6366 -8.6366 4.8197 13.3027 13.6779 13.6779 17.9701 27.0763 45.3121 45.3121 46.0311 46.0321 58.2249 361.4622 electronvolt
energy: -284.8152 -16.5107 -2.8089 0.3526 0.3526 6.4273 15.4981 17.1277 17.1277 21.1676 28.8816 49.3881 49.3881 50.7990 50.8003 61.5364 363.4172 electronvolt
chargesum: -0.0000000
charge: -0.265219 0.265219
charge: -0.154553 0.154553
qa: -0.2652 0.2652
va: 3.7229 0.9084
energy: -38.365594398275 hartree
dipole: -0.93822 0.64674 -0.29147 0.00000 0.00000 0.00000 0.00000 0.00000 0.00000
magnitude: 0.29147 au
magnitude: 0.74087 debye
