program: Orca
programVersion: 5.0.4
elementType: C H
charge: -1
multiplicity: 1
keywords: SP CCSD(T) aug-cc-pVQZ aug-cc-pVQZ/C TightSCF
keywords: NoFrozenCore
formula: CH
InChI: InChI=1/CH/h1H
2 atoms
C  0.089166 0.0000 0.0000
H  -1.062508 0.0000 0.0000
totalener: -38.23299208 hartree
nucrepener: 2.75691096 hartree
electener: -40.98990304 hartree
oneelecener: -58.53224996 hartree
twoeener: 17.54234692 hartree
kineticenergy: 38.19372302 hartree
energy: -299.7154 -14.3967 -4.4407 -0.4675 3.9613 5.6215 6.1389 6.6471 7.7980 8.8862 10.2094 10.9878 11.0680 11.6004 11.6243 12.3477 12.6898 12.7616 14.5910 17.3065 19.2718 19.5535 21.5494 23.1740 23.5008 24.3718 24.3728 25.9877 27.1805 27.2773 27.2806 28.2818 28.3823 28.8888 29.3849 30.3829 31.1720 31.5789 31.6995 31.7755 36.2480 41.3717 41.7903 45.4625 52.0617 52.0667 53.2025 53.6228 53.7530 58.3423 59.3145 59.3792 59.9544 60.8502 65.2909 65.6019 65.6046 66.1735 66.1857 66.9341 67.6276 69.5935 69.7524 69.9839 70.0051 70.3755 71.7602 72.6728 72.6844 73.0439 73.1138 73.3241 73.9672 79.5166 80.3295 86.3350 93.8405 100.8099 101.5893 102.6149 102.6559 116.8293 118.9097 119.0420 119.9688 167.2052 167.3198 167.9475 169.0086 169.4293 169.5791 170.2536 170.2572 171.5834 175.9370 176.9909 178.1223 179.3915 182.3691 182.4130 184.4436 185.2128 185.2210 187.6561 187.8961 188.2231 191.4894 191.4896 203.9002 204.8592 205.9816 214.3301 214.3336 230.7561 231.2506 233.2833 249.1652 249.1772 253.6800 261.2910 261.7764 273.1093 273.8892 286.7504 333.4599 628.8227 electronvolt
e0: -38.232992078 hartree
ecorr: -0.207827835 hartree
chargesum: -1.0000000
charge: -1.145940 0.145940
charge: -0.037133 -0.962867
qa: -1.1459 0.1459
va: 1.8791 1.0846
energy: -38.450535745583 hartree
dipole: -0.99682 0.55096 -0.44586 0.00000 -0.00000 -0.00000 0.00000 -0.00000 -0.00000
magnitude: 0.44586 au
magnitude: 1.13329 debye
dipolemethod: MDCI
